{
   "fireTV":[
      "Fire TV Cube 1st Gen",
      "Fire TV Cube 2nd Gen",
      "Fire TV 3rd Gen",
      "Fire TV Stick 4K -1st Gen",
      "Fire TV Stick-2nd Gen",
      "Fire TV Stick Lite 1st Gen",
      "Fire TV Stick 3rd Gen",
      "Fire TV Stick 4k Max-1st Gen"
   ],
   "xbox":[
      "XBOX One",
      "XBOX One S",
      "XBOX One X",
      "Xbox Series S",
      "Xbox Series X"
   ],
   "comcast":[
      "Comcast Flex"
   ],
   "LG":[
      "LG Models 2021",
      "LG Models 2020",
      "LG Models 2019",
      "LG models 2018"
   ],
   "roku":[
      "Roku Express",
      "Roku Express 4K",
      "Roku Express 4K+",
      "Roku Streaming Stick 4K",
      "Roku Streaming Stick 4K+",
      "Roku Ultra LT",
      "Roku Ultra",
      "Roku Streambar",
      "Roku Streambar Pro"
   ]
}