<svg xmlns="http://www.w3.org/2000/svg" width="33" height="30" viewBox="0 0 33 30">
  <rect width="33" height="30" fill="none" />
  <g transform="translate(9 5)">
    <path d="M16,8c0,6.222-8,11.556-8,11.556S0,14.222,0,8A8,8,0,0,1,16,8Z" transform="translate(0 0)" fill="none"
          stroke="#798592" stroke-linecap="round" stroke-linejoin="round" stroke-miterlimit="10" stroke-width="1.5" />
    <circle cx="2.667" cy="2.667" r="2.667" transform="translate(5.333 5.333)" fill="none" stroke="#798592"
            stroke-linecap="round" stroke-linejoin="round" stroke-miterlimit="10" stroke-width="1.5" />
  </g>
</svg>
