<svg xmlns="http://www.w3.org/2000/svg" width="110.074" height="98.312" viewBox="0 0 110.074 98.312">
  <g id="NoContent-List-Uploaded-EmptyState" transform="translate(-19.994 -966)">
    <path id="Path_376" d="M91.283,55.509c0,11.7-7.853,30-29.267,29.474C42.91,84.518,10.081,66.227,10.081,55.509c0-10.16-4.974-36.161,13.469-37.126,13.516-.708,58.585-10.54,74.135,0C106.925,24.643,91.283,50.85,91.283,55.509Z" transform="translate(6.467 987.677) rotate(-19.993)" fill="rgba(173,219,239,0.4)"/>
    <path id="Union_8" d="M49.333,5.44V3.773H47.667a.666.666,0,1,1,0-1.333h1.667V.774a.666.666,0,0,1,1.332,0V2.44h1.667a.666.666,0,1,1,0,1.333H50.666V5.44a.666.666,0,1,1-1.332,0Z" transform="translate(20 965.891)" fill="#b2e0f3"/>
    <circle id="Ellipse_15" cx="1.5" cy="1.5" r="1.5" transform="translate(38 980)" fill="#0075a3"/>
    <path id="Union_9" d="M11.472,67.988V66.321H9.805a.667.667,0,1,1,0-1.333h1.667V63.322a.666.666,0,1,1,1.332,0v1.666h1.667a.667.667,0,1,1,0,1.333H12.8v1.667a.666.666,0,1,1-1.332,0Z" transform="translate(20 965.891)" fill="#0075a3"/>
    <circle id="Ellipse_16" cx="1.5" cy="1.5" r="1.5" transform="translate(120 1011)" fill="#b2e0f3"/>
    <circle id="Ellipse_17" cx="1.5" cy="1.5" r="1.5" transform="translate(102.139 975.047)" fill="#fff"/>
    <circle id="Ellipse_18" cx="1.5" cy="1.5" r="1.5" transform="translate(67.139 1044.047)" fill="#fff"/>
    <path id="Path_383" d="M20.115,44.886l-1.743.255-.032.006a.273.273,0,0,0-.12.459l1.261,1.228-.3,1.735v.03a.273.273,0,0,0,.4.257l1.559-.82,1.558.819.027.013a.273.273,0,0,0,.368-.3l-.3-1.735,1.261-1.228.021-.023a.273.273,0,0,0-.172-.442l-1.743-.255-.779-1.579a.273.273,0,0,0-.489,0Z" transform="translate(20 965.891)" fill="#58a9cb"/>
    <path id="Path_384" d="M93.115,24.886l-1.743.255-.032.006a.273.273,0,0,0-.12.459l1.261,1.228-.3,1.735v.03a.273.273,0,0,0,.4.257l1.559-.82,1.558.819.027.013a.273.273,0,0,0,.368-.3l-.3-1.735,1.261-1.228.021-.023a.273.273,0,0,0-.172-.442l-1.743-.255-.779-1.579a.273.273,0,0,0-.489,0Z" transform="translate(20 965.891)" fill="#0075a3"/>
    <path id="Path" d="M32.739,15.108h41a2.5,2.5,0,0,1,2.5,2.5v51a2.5,2.5,0,0,1-2.5,2.5h-41a2.5,2.5,0,0,1-2.5-2.5v-51A2.5,2.5,0,0,1,32.739,15.108Z" transform="translate(20 965.891)" fill="#b2e0f3"/>
    <path id="Path-2" data-name="Path" d="M30.051,15.108h5v56h-5Z" transform="translate(20 965.891)" fill="#58aacb"/>
    <path id="Path-3" data-name="Path" d="M73.739,13.108h-41a4.5,4.5,0,0,0-4.5,4.5v51a4.5,4.5,0,0,0,4.5,4.5h41a4.5,4.5,0,0,0,4.5-4.5v-51A4.5,4.5,0,0,0,73.739,13.108Zm0,2a2.5,2.5,0,0,1,2.5,2.5v51a2.5,2.5,0,0,1-2.5,2.5h-41a2.5,2.5,0,0,1-2.5-2.5v-51a2.5,2.5,0,0,1,2.5-2.5Z" transform="translate(20 965.891)" fill="#0075a3"/>
    <path id="Shape" d="M73,9.108a2.558,2.558,0,0,0-2.026,1l-4.441,5.75a2.553,2.553,0,0,0-.268,2.693l.086.16a2.558,2.558,0,0,0,2.208,1.263h.211V23.2a2.556,2.556,0,0,0,2.557,2.555h3.345l.168-.005A2.556,2.556,0,0,0,77.23,23.2V19.97h.213a2.555,2.555,0,0,0,2.024-4.117L75.025,10.1A2.558,2.558,0,0,0,73,9.108Zm0,2a.559.559,0,0,1,.372.142l.07.075,4.442,5.751a.555.555,0,0,1-.352.887l-.09.007H75.787a.557.557,0,0,0-.55.465l-.007.09V23.2a.556.556,0,0,1-.467.548l-.09.007H71.328a.557.557,0,0,1-.55-.465l-.007-.09V18.525a.556.556,0,0,0-.467-.548l-.09-.007H68.558a.555.555,0,0,1-.491-.819l.049-.075,4.442-5.751A.558.558,0,0,1,73,11.108Z" transform="translate(20 965.891)" fill="#0075a3"/>
    <path id="Shape-2" data-name="Shape" d="M73,23.754h1.672a.556.556,0,0,0,.557-.555V18.525a.556.556,0,0,1,.557-.555h1.655a.555.555,0,0,0,.442-.894l-4.442-5.751a.559.559,0,0,0-.884,0l-4.442,5.751a.555.555,0,0,0,.442.894h1.655a.556.556,0,0,1,.557.555V23.2a.556.556,0,0,0,.557.555Z" transform="translate(20 965.891)" fill="#fff"/>
    <path id="Combined-Shape" d="M32.479,59.116v2.922H26V59.116Zm0-11.646v2.922H26V47.471Zm0-11.646v2.922H26V35.825Zm0-11.646V27.1H26V24.179Z" transform="translate(20 965.891)" fill="#0075a3"/>
    <path id="Combined-Shape-2" data-name="Combined-Shape" d="M62.789,61.313a1.852,1.852,0,0,1,0,3.7H43.225a1.852,1.852,0,0,1,0-3.7H62.789Zm0-5.175a1.852,1.852,0,0,1,0,3.7H43.225a1.852,1.852,0,0,1,0-3.7H62.789Z" transform="translate(20 965.891)" fill="#fff"/>
    <path id="Path-4" data-name="Path" d="M59.1,31.613a6.379,6.379,0,0,1-1.856,4.6,6.053,6.053,0,0,1-4.481,1.906h0a6.054,6.054,0,0,1-4.477-1.906,6.625,6.625,0,0,1,0-9.2,6.052,6.052,0,0,1,4.477-1.906h0a6.055,6.055,0,0,1,4.481,1.906A6.379,6.379,0,0,1,59.1,31.613Z" transform="translate(20 965.891)" fill="#fff"/>
    <path id="Path-5" data-name="Path" d="M64,47.454a4.556,4.556,0,0,1-1.3,3.4,4.612,4.612,0,0,1-3.351,1.255h-12.7A4.61,4.61,0,0,1,43.3,50.854a4.555,4.555,0,0,1-1.3-3.4c0-.543.018-1.081.053-1.6a16.4,16.4,0,0,1,.214-1.711,13.8,13.8,0,0,1,.409-1.719,8.642,8.642,0,0,1,.689-1.6A6.055,6.055,0,0,1,44.4,39.433a4.565,4.565,0,0,1,1.492-.962,5.041,5.041,0,0,1,1.9-.354,1.9,1.9,0,0,1,1.032.449c.314.21.676.45,1.076.712a6.065,6.065,0,0,0,1.391.629,5.417,5.417,0,0,0,1.533.279q.084,0,.168,0a5.4,5.4,0,0,0,1.7-.282,6.065,6.065,0,0,0,1.391-.629c.4-.265.766-.5,1.076-.712a1.9,1.9,0,0,1,1.032-.449,5.043,5.043,0,0,1,1.9.354,4.569,4.569,0,0,1,1.492.962,6.033,6.033,0,0,1,1.038,1.389,8.613,8.613,0,0,1,.689,1.6,13.784,13.784,0,0,1,.41,1.72,16.557,16.557,0,0,1,.213,1.71c.036.515.053,1.053.054,1.6Z" transform="translate(20 965.891)" fill="#0075a3"/>
    <path id="Path-6" data-name="Path" d="M52.883,38.118h0V25.108h0a6.051,6.051,0,0,1,4.479,1.906,6.627,6.627,0,0,1,0,9.2A6.049,6.049,0,0,1,52.883,38.118Z" transform="translate(20 965.891)" fill="rgba(178,224,243,0.45)"/>
    <path id="Path-7" data-name="Path" d="M64,47.454a4.381,4.381,0,0,1-4.631,4.655H52.88V40.187q.084,0,.168,0a5.356,5.356,0,0,0,1.694-.282,6.025,6.025,0,0,0,1.385-.629c.4-.265.763-.5,1.071-.712a1.888,1.888,0,0,1,1.028-.449,5,5,0,0,1,1.9.354,4.546,4.546,0,0,1,1.485.962,6.031,6.031,0,0,1,1.034,1.389,8.633,8.633,0,0,1,.686,1.6,13.835,13.835,0,0,1,.408,1.72,16.628,16.628,0,0,1,.212,1.71c.035.515.053,1.053.053,1.6Z" transform="translate(20 965.891)" fill="#00658d"/>
    <g id="search" transform="matrix(0.94, -0.342, 0.342, 0.94, 76.342, 1026.231)">
      <path id="Rectangle" d="M15.452,15.014H18.16v3.521H15.452Z" transform="translate(16.828 40.519) rotate(-135)" fill="#00658d"/>
      <circle id="Oval" cx="8" cy="8" r="8" transform="translate(2 2)" fill="#fff"/>
      <path id="Shape-3" data-name="Shape" d="M16.214,16.231A9.515,9.515,0,0,1,2.766,2.769,9.515,9.515,0,0,1,16.214,16.231ZM4.338,4.343a7.328,7.328,0,1,0,10.357,0A7.312,7.312,0,0,0,4.338,4.343Z" fill="#0075a3"/>
      <path id="Path-8" data-name="Path" d="M19.315,16a53.082,53.082,0,0,1,5.707,4.293,3.343,3.343,0,0,1-4.728,4.728A62.018,62.018,0,0,1,16,19.315Z" fill="#58aacb"/>
      <ellipse id="Oval-2" data-name="Oval" cx="2.5" cy="1.5" rx="2.5" ry="1.5" transform="translate(7 4)" fill="#daedf5"/>
    </g>
  </g>
</svg>
