<svg xmlns="http://www.w3.org/2000/svg" width="110.074" height="98.312" viewBox="0 0 110.074 98.312">
  <g id="File-Uploading-Progress-Icon" transform="translate(-240 -957)">
    <path id="Path_376" d="M92.144,55.4c0,11.7-7.853,30-29.267,29.474C43.772,84.409,10.942,66.118,10.942,55.4c0-10.16-4.974-36.161,13.469-37.126,13.516-.708,58.585-10.54,74.135,0C107.787,24.534,92.144,50.742,92.144,55.4Z" transform="translate(225.7 979.074) rotate(-19.993)" fill="rgba(173,219,239,0.4)"/>
    <path id="Union_8" d="M50.195,5.332V3.665H48.528a.666.666,0,1,1,0-1.333h1.667V.666a.666.666,0,0,1,1.332,0V2.332h1.667a.666.666,0,1,1,0,1.333H51.527V5.332a.666.666,0,0,1-1.332,0Z" transform="translate(239.138 957)" fill="#b2e0f3"/>
    <circle id="Ellipse_15" cx="1.5" cy="1.5" r="1.5" transform="translate(258 971)" fill="#0075a3"/>
    <path id="Union_9" d="M12.333,67.88V66.213H10.667a.667.667,0,1,1,0-1.333h1.667V63.214a.666.666,0,1,1,1.332,0V64.88h1.667a.667.667,0,0,1,0,1.333H13.665V67.88a.666.666,0,1,1-1.332,0Z" transform="translate(239.138 957)" fill="#0075a3"/>
    <circle id="Ellipse_16" cx="1.5" cy="1.5" r="1.5" transform="translate(340 1002)" fill="#b2e0f3"/>
    <circle id="Ellipse_17" cx="1.5" cy="1.5" r="1.5" transform="translate(322.139 966.047)" fill="#fff"/>
    <circle id="Ellipse_18" cx="1.5" cy="1.5" r="1.5" transform="translate(287.139 1035.047)" fill="#fff"/>
    <path id="Path_383" d="M20.976,44.778l-1.743.255-.032.006a.273.273,0,0,0-.12.459l1.261,1.228-.3,1.735v.03a.273.273,0,0,0,.4.257L22,47.928l1.558.819.027.013a.273.273,0,0,0,.368-.3l-.3-1.735L24.916,45.5l.021-.023a.273.273,0,0,0-.172-.442l-1.743-.255L22.243,43.2a.273.273,0,0,0-.489,0Z" transform="translate(239.138 957)" fill="#58a9cb"/>
    <path id="Path_384" d="M93.977,24.778l-1.743.255-.032.006a.273.273,0,0,0-.12.459l1.261,1.228-.3,1.735v.03a.273.273,0,0,0,.4.257L95,27.928l1.558.819.027.013a.273.273,0,0,0,.368-.3l-.3-1.735L97.915,25.5l.021-.023a.273.273,0,0,0-.172-.442l-1.743-.255L95.243,23.2a.273.273,0,0,0-.489,0Z" transform="translate(239.138 957)" fill="#0075a3"/>
    <path id="Path" d="M33.739,16h41a2.5,2.5,0,0,1,2.5,2.5v51a2.5,2.5,0,0,1-2.5,2.5h-41a2.5,2.5,0,0,1-2.5-2.5v-51A2.5,2.5,0,0,1,33.739,16Z" transform="translate(239 957)" fill="#b2e0f3"/>
    <path id="Path-2" data-name="Path" d="M31.051,16h5V72h-5Z" transform="translate(239 957)" fill="#58aacb"/>
    <path id="Path-3" data-name="Path" d="M74.739,14h-41a4.5,4.5,0,0,0-4.5,4.5v51a4.5,4.5,0,0,0,4.5,4.5h41a4.5,4.5,0,0,0,4.5-4.5v-51A4.5,4.5,0,0,0,74.739,14Zm0,2a2.5,2.5,0,0,1,2.5,2.5v51a2.5,2.5,0,0,1-2.5,2.5h-41a2.5,2.5,0,0,1-2.5-2.5v-51a2.5,2.5,0,0,1,2.5-2.5Z" transform="translate(239 957)" fill="#0075a3"/>
    <path id="Combined-Shape" d="M33.479,60.008v2.922H27V60.008Zm0-11.646v2.922H27V48.362Zm0-11.646v2.922H27V36.716Zm0-11.646v2.922H27V25.071Z" transform="translate(239 957)" fill="#0075a3"/>
    <path id="Combined-Shape-2" data-name="Combined-Shape" d="M65.63,62.2a1.858,1.858,0,1,1,0,3.7H44.384a1.858,1.858,0,1,1,0-3.7H65.63Zm0-5.175a1.858,1.858,0,1,1,0,3.7H44.384a1.858,1.858,0,1,1,0-3.7H65.63Z" transform="translate(239 957)" fill="#fff"/>
    <path id="Path-4" data-name="Path" d="M60.1,32.5a6.379,6.379,0,0,1-1.856,4.6,6.053,6.053,0,0,1-4.481,1.906h0A6.054,6.054,0,0,1,49.28,37.1a6.625,6.625,0,0,1,0-9.2A6.052,6.052,0,0,1,53.758,26h0a6.055,6.055,0,0,1,4.481,1.906A6.379,6.379,0,0,1,60.1,32.5Z" transform="translate(239 957)" fill="#fff"/>
    <path id="Path-5" data-name="Path" d="M65,48.345a4.556,4.556,0,0,1-1.3,3.4A4.612,4.612,0,0,1,60.348,53h-12.7A4.61,4.61,0,0,1,44.3,51.745a4.555,4.555,0,0,1-1.3-3.4c0-.543.018-1.081.053-1.6a16.4,16.4,0,0,1,.214-1.711,13.8,13.8,0,0,1,.409-1.719,8.642,8.642,0,0,1,.689-1.6A6.055,6.055,0,0,1,45.4,40.325a4.565,4.565,0,0,1,1.492-.962,5.041,5.041,0,0,1,1.9-.354,1.9,1.9,0,0,1,1.032.449c.314.21.676.45,1.076.712A6.065,6.065,0,0,0,52.3,40.8a5.417,5.417,0,0,0,1.533.279q.084,0,.168,0a5.4,5.4,0,0,0,1.7-.282,6.065,6.065,0,0,0,1.391-.629c.4-.265.766-.5,1.076-.712a1.9,1.9,0,0,1,1.032-.449,5.043,5.043,0,0,1,1.9.354,4.569,4.569,0,0,1,1.492.962,6.033,6.033,0,0,1,1.038,1.389,8.612,8.612,0,0,1,.689,1.6,13.782,13.782,0,0,1,.41,1.72,16.554,16.554,0,0,1,.213,1.71c.036.515.053,1.053.054,1.6Z" transform="translate(239 957)" fill="#0075a3"/>
    <path id="Path-6" data-name="Path" d="M53.883,39.009h0V26h0a6.051,6.051,0,0,1,4.479,1.906,6.627,6.627,0,0,1,0,9.2A6.049,6.049,0,0,1,53.883,39.009Z" transform="translate(239 957)" fill="rgba(178,224,243,0.45)"/>
    <path id="Path-7" data-name="Path" d="M65,48.345A4.381,4.381,0,0,1,60.369,53H53.88V41.078q.084,0,.168,0a5.356,5.356,0,0,0,1.694-.282,6.025,6.025,0,0,0,1.385-.629c.4-.265.763-.5,1.071-.712a1.888,1.888,0,0,1,1.028-.449,5,5,0,0,1,1.9.354,4.546,4.546,0,0,1,1.485.962,6.031,6.031,0,0,1,1.034,1.389,8.633,8.633,0,0,1,.686,1.6,13.836,13.836,0,0,1,.408,1.72,16.626,16.626,0,0,1,.212,1.71c.035.515.053,1.053.053,1.6Z" transform="translate(239 957)" fill="#00658d"/>
    <path id="Shape" d="M78,44a3.345,3.345,0,0,0-2.638,1.284L64.7,58.927a3.3,3.3,0,0,0-.353,3.512l.1.185a3.342,3.342,0,0,0,2.891,1.656h3.308V74.683A3.327,3.327,0,0,0,73.986,78h8.027l.182,0a3.326,3.326,0,0,0,3.155-3.312V64.278h3.31a3.34,3.34,0,0,0,2.99-1.84,3.3,3.3,0,0,0-.353-3.512L80.637,45.283A3.345,3.345,0,0,0,78,44Zm0,2a1.348,1.348,0,0,1,.972.412l.089.1L89.722,60.158a1.3,1.3,0,0,1,.14,1.385,1.338,1.338,0,0,1-1.063.728l-.138.007H84.689a1.33,1.33,0,0,0-1.331,1.182l-.007.135V74.683a1.325,1.325,0,0,1-1.2,1.31L82.014,76H73.986a1.33,1.33,0,0,1-1.331-1.182l-.007-.135V63.6a1.325,1.325,0,0,0-1.2-1.31l-.137-.007H67.339a1.34,1.34,0,0,1-1.2-.735,1.3,1.3,0,0,1,.054-1.262l.086-.123L76.939,46.515A1.345,1.345,0,0,1,78,46Z" transform="translate(239 957)" fill="#0075a3"/>
    <path id="Shape-2" data-name="Shape" d="M78,76h4.014a1.328,1.328,0,0,0,1.338-1.317V63.6a1.328,1.328,0,0,1,1.338-1.317h3.972a1.34,1.34,0,0,0,1.2-.735,1.3,1.3,0,0,0-.14-1.385L79.061,46.515a1.351,1.351,0,0,0-2.122,0L66.278,60.158a1.3,1.3,0,0,0-.14,1.385,1.34,1.34,0,0,0,1.2.735h3.972A1.328,1.328,0,0,1,72.649,63.6V74.683A1.328,1.328,0,0,0,73.986,76Z" transform="translate(239 957)" fill="#fff"/>
  </g>
</svg>
