<svg xmlns="http://www.w3.org/2000/svg" width="22.5" height="21.5" viewBox="0 0 22.5 21.5">
  <path id="Star" d="M7.661,6.74,1.125,7.7l-.143.031A1.023,1.023,0,0,0,.559,9.441l4.728,4.605L4.171,20.552l-.015.137a1.023,1.023,0,0,0,1.5.941L11.5,18.557l5.844,3.073.126.056a1.023,1.023,0,0,0,1.358-1.134l-1.114-6.506,4.726-4.605.1-.109A1.023,1.023,0,0,0,21.873,7.7L15.339,6.74,12.416.82a1.023,1.023,0,0,0-1.834,0ZM11.5,3.583l2.243,4.545.072.123a1.023,1.023,0,0,0,.7.436l5.018.732L15.9,12.956l-.1.107a1.023,1.023,0,0,0-.2.8l.857,4.993L11.975,16.5l-.131-.058a1.023,1.023,0,0,0-.821.058L6.539,18.854l.855-4.993.014-.142a1.023,1.023,0,0,0-.309-.763L3.471,9.419l5.016-.732a1.023,1.023,0,0,0,.769-.559Z" transform="translate(-0.249 -0.25)" fill="#76797b"/>
</svg>
