<svg xmlns="http://www.w3.org/2000/svg" width="13" height="12.259" viewBox="0 0 13 12.259">
  <g id="Tablle-UP-Down-Arrow-Default" transform="translate(-6604 -5497.5)">
    <path id="Union_12" data-name="Union 12" d="M2.45,12.259V4.5H0L3,0,6,4.5H3.451v7.759Z" transform="translate(6604 5497.5)" fill="#76797b"/>
    <path id="Union_13" data-name="Union 13" d="M2.45,12.259V4.5H0L3,0,6,4.5H3.451v7.759Z" transform="translate(6617 5509.759) rotate(180)" fill="#76797b"/>
  </g>
</svg>
