<svg xmlns="http://www.w3.org/2000/svg" width="43.089" height="38.433" viewBox="0 0 43.089 38.433">
  <g id="Group_3" data-name="Group 3" transform="translate(0)">
    <path id="Oval"
          d="M18.644,22.867c14.743,3.055,2.395-6.06,15.959-10.919C42.072,9.272,21.565.376,9.5.009-.352-.291-2.34,7.046,2.6,11.948,13.6,22.856,3.9,19.812,18.644,22.867Z"
          transform="translate(0 18.1) rotate(-30)" fill="rgba(173,219,239,0.4)" />
    <path id="Path"
          d="M21.337,6.547c-.013-.687-.025-1.335-.025-1.962a.89.89,0,0,0-.89-.89A12.272,12.272,0,0,1,11.3.252a.889.889,0,0,0-1.241,0A12.27,12.27,0,0,1,.943,3.695a.89.89,0,0,0-.89.89c0,.627-.012,1.276-.025,1.963-.122,6.388-.289,15.138,10.363,18.83a.888.888,0,0,0,.291.049h0a.883.883,0,0,0,.291-.049c10.653-3.692,10.486-12.442,10.364-18.83Z"
          transform="translate(9.212 4.405)" fill="#c9cacb" />
    <path id="Path-2" data-name="Path"
          d="M.291,25.378A.883.883,0,0,1,0,25.427V0A.885.885,0,0,1,.62.252,12.272,12.272,0,0,0,9.74,3.695a.89.89,0,0,1,.89.89c0,.627.012,1.276.025,1.962.122,6.388.289,15.138-10.364,18.83Z"
          transform="translate(19.894 4.405)" fill="#f1f2f2" />
    <path id="Shape"
          d="M10.922,26.92A17.165,17.165,0,0,1,4.5,23.138a13.637,13.637,0,0,1-3.282-5.1C-.109,14.455-.033,10.5.027,7.327.041,6.647.052,6,.052,5.379A1.683,1.683,0,0,1,1.733,3.7,11.527,11.527,0,0,0,10.3.48a1.672,1.672,0,0,1,2.345,0A11.528,11.528,0,0,0,21.213,3.7a1.683,1.683,0,0,1,1.681,1.681c0,.612.012,1.248.025,1.922v.025c.061,3.176.136,7.129-1.191,10.716a13.615,13.615,0,0,1-3.282,5.1,17.158,17.158,0,0,1-6.423,3.782,1.68,1.68,0,0,1-1.1,0Z"
          transform="translate(8.421 3.611)" fill="#0075a3" />
    <path id="Path-3" data-name="Path"
          d="M10.888,3.865V7.023a.527.527,0,0,1-.528.528H7.551v2.81a.528.528,0,0,1-.528.528H3.865a.528.528,0,0,1-.528-.528V7.551H.528A.527.527,0,0,1,0,7.023V3.865a.527.527,0,0,1,.528-.528h2.81V.528A.528.528,0,0,1,3.865,0H7.024a.528.528,0,0,1,.528.528v2.81h2.81A.527.527,0,0,1,10.888,3.865Z"
          transform="translate(14.45 11.147)" fill="#fff" />
    <path id="Path-4" data-name="Path"
          d="M5.444,3.865V7.023a.527.527,0,0,1-.528.528H2.107v2.81a.528.528,0,0,1-.528.528H0V0H1.579a.528.528,0,0,1,.528.528v2.81h2.81A.527.527,0,0,1,5.444,3.865Z"
          transform="translate(19.894 11.147)" fill="#e3e4e4" />
    <path id="Path-5" data-name="Path"
          d="M10.256,18.042a13.628,13.628,0,0,1-3.282,5.1A17.153,17.153,0,0,1,.55,26.919a1.669,1.669,0,0,1-.55.093V25.43a.088.088,0,0,0,.031-.006c4.483-1.554,7.342-4.148,8.74-7.931a22.826,22.826,0,0,0,1.12-7.938c0-.749-.014-1.484-.028-2.2V7.33c-.013-.681-.025-1.325-.025-1.951a.1.1,0,0,0-.1-.1A13.015,13.015,0,0,1,.069,1.614.1.1,0,0,0,0,1.586V0A1.675,1.675,0,0,1,1.172.48,11.527,11.527,0,0,0,9.74,3.7a1.683,1.683,0,0,1,1.681,1.681c0,.612.012,1.248.025,1.921v.026C11.507,10.5,11.582,14.455,10.256,18.042Z"
          transform="translate(19.894 3.611)" fill="#0075a3" />
  </g>
</svg>
