<?xml version="1.0" encoding="UTF-8"?>
<svg width="14px" height="14px" viewBox="0 0 14 14" version="1.1" xmlns="http://www.w3.org/2000/svg"
>
  <!-- Generator: Sketch 61.2 (89653) - https://sketch.com -->
  <title>Combined Shape</title>
  <desc>Created with Sketch.</desc>
  <g id="Page-1" stroke="none" stroke-width="1" fill="none" fill-rule="evenodd">
    <g id="cross-white" fill="#FFFFFF" fill-rule="nonzero">
      <path
        d="M1.44621165,0.397051761 L1.53033009,0.469669914 L7,5.939 L12.4696699,0.469669914 C12.7625631,0.176776695 13.2374369,0.176776695 13.5303301,0.469669914 C13.7965966,0.735936477 13.8208027,1.15260016 13.6029482,1.44621165 L13.5303301,1.53033009 L8.061,7 L13.5303301,12.4696699 C13.8232233,12.7625631 13.8232233,13.2374369 13.5303301,13.5303301 C13.2640635,13.7965966 12.8473998,13.8208027 12.5537883,13.6029482 L12.4696699,13.5303301 L7,8.061 L1.53033009,13.5303301 C1.23743687,13.8232233 0.762563133,13.8232233 0.469669914,13.5303301 C0.203403352,13.2640635 0.1791973,12.8473998 0.397051761,12.5537883 L0.469669914,12.4696699 L5.939,7 L0.469669914,1.53033009 C0.176776695,1.23743687 0.176776695,0.762563133 0.469669914,0.469669914 C0.735936477,0.203403352 1.15260016,0.1791973 1.44621165,0.397051761 Z"
        id="Combined-Shape"></path>
    </g>
  </g>
</svg>
