<?xml version="1.0" encoding="UTF-8"?>
<svg width="15px" height="15px" viewBox="0 0 15 15" version="1.1" xmlns="http://www.w3.org/2000/svg"
>
  <!-- Generator: Sketch 63.1 (92452) - https://sketch.com -->
  <title>Clear-Redicon</title>
  <desc>Created with Sketch.</desc>
  <g id="Page-1" stroke="none" stroke-width="1" fill="none" fill-rule="evenodd">
    <g id="Clear-Redicon">
      <circle id="Oval" fill="#D42F30" cx="7.5" cy="7.5" r="7.5"></circle>
      <path
        d="M7.5,4.25 C7.91421356,4.25 8.25,4.58578644 8.25,5 L8.25,10.5 C8.25,10.9142136 7.91421356,11.25 7.5,11.25 C7.08578644,11.25 6.75,10.9142136 6.75,10.5 L6.75,5 C6.75,4.58578644 7.08578644,4.25 7.5,4.25 Z"
        id="Rectangle" fill="#FFFFFF"
        transform="translate(7.500000, 7.750000) rotate(90.000000) translate(-7.500000, -7.750000) "></path>
    </g>
  </g>
</svg>
