<?xml version="1.0" encoding="UTF-8"?>
<svg width="88px" height="71px" viewBox="0 0 88 71" version="1.1" xmlns="http://www.w3.org/2000/svg" xmlns:xlink="http://www.w3.org/1999/xlink">
    <!-- Generator: Sketch 63.1 (92452) - https://sketch.com -->
    <title>Drag&amp;Drop-Icon</title>
    <desc>Created with Sketch.</desc>
    <g id="Page-1" stroke="none" stroke-width="1" fill="none" fill-rule="evenodd">
        <g id="Drag&amp;Drop-Icon" transform="translate(-1.000000, 0.000000)" fill-rule="nonzero">
            <g id="Rectangle_661" stroke-dasharray="4" transform="translate(38.862000, 14.000000)">
                <rect id="Rectangle" fill="#FFFFFF" x="0" y="0" width="32" height="32" rx="4"></rect>
                <path d="M31.9116902,3.16116727 L29.9558374,3.57906623 C29.7605449,2.6650572 28.9478684,2 28,2 L28,0 C29.8961624,0 31.5202325,1.32906455 31.9116902,3.16116727 Z M32,11.4077988 L30,11.4077988 L30,7.40779881 L32,7.40779881 L32,11.4077988 Z M32,19.4077988 L30,19.4077988 L30,15.4077988 L32,15.4077988 L32,19.4077988 Z M32,27.4077988 L30,27.4077988 L30,23.4077988 L32,23.4077988 L32,27.4077988 Z M25.1846444,32 L25.1841603,30 L28.0439709,29.9995309 C28.3135628,29.993771 28.5734894,29.9349928 28.8137382,29.8277906 L29.6287116,31.6542129 C29.1462924,31.8694746 28.6239406,31.9875962 28.0655731,31.9993027 L25.1846444,32 Z M17.1844024,32 L17.1844024,30 L21.1844024,30 L21.1844024,32 L17.1844024,32 Z M9.18440238,32 L9.18440238,30 L13.1844024,30 L13.1844024,32 L9.18440238,32 Z M0.685309193,30.2394715 L2.34176696,29.1186916 C2.71227792,29.6662886 3.32710504,30 4,30 L5.18440238,30 L5.18440238,32 L4,32 C2.65615686,32 1.42399843,31.3312179 0.685309193,30.2394715 Z M0,21.7766036 L2,21.7766036 L2,25.7766036 L0,25.7766036 L0,21.7766036 Z M0,13.7766036 L2,13.7766036 L2,17.7766036 L0,17.7766036 L0,13.7766036 Z M0,5.77660357 L2,5.77660357 L2,9.77660357 L0,9.77660357 L0,5.77660357 Z M5.63119525,0 L5.63119525,2 L4,2 C3.44317592,2 2.92509493,2.22734154 2.54911287,2.62342735 L1.09856649,1.24650498 C1.84835892,0.456621172 2.88893756,0 4,0 L5.63119525,0 Z M13.6311952,0 L13.6311952,2 L9.63119525,2 L9.63119525,0 L13.6311952,0 Z M21.6311952,0 L21.6311952,2 L17.6311952,2 L17.6311952,0 L21.6311952,0 Z M28,0 L28,2 L25.6311952,2 L25.6311952,0 L28,0 Z" id="Rectangle" fill="#58AACB"></path>
            </g>
            <path d="M54.363,34 L54.363,31.5 L51.863,31.5 C51.3107153,31.5 50.863,31.0522847 50.863,30.5 C50.863,29.9477153 51.3107153,29.5 51.863,29.5 L54.363,29.5 L54.363,27 C54.363,26.4477153 54.8107153,26 55.363,26 C55.9152847,26 56.363,26.4477153 56.363,27 L56.363,29.5 L58.863,29.5 C59.4152847,29.5 59.863,29.9477153 59.863,30.5 C59.863,31.0522847 59.4152847,31.5 58.863,31.5 L56.363,31.5 L56.363,34 C56.363,34.5522847 55.9152847,35 55.363,35 C54.8107153,35 54.363,34.5522847 54.363,34 Z" id="Union_13" fill="#58AACB"></path>
            <rect id="Rectangle_664" fill="#0075A3" x="12.862" y="27" width="36" height="36" rx="4"></rect>
            <rect id="Rectangle_665" fill="#B2E0F3" x="14.862" y="29" width="32" height="32" rx="4"></rect>
            <polygon id="Path_434" fill="#FFFFFF" points="57.738 56.076 53.508 60.302 59.653 66.44 56.153 69.933 50.01 63.795 45.778 68.022 38.635 48.941"></polygon>
            <path d="M54.97,60.253 L58.111,57.115 C58.4004451,56.8249421 58.5228046,56.4077575 58.4358831,56.0073119 C58.3489615,55.6068662 58.0646526,55.2779539 57.681,55.134 L39.645,48.397 C39.2025778,48.2316886 38.7043685,48.3400822 38.3706189,48.6742624 C38.0368693,49.0084427 37.9291183,49.5067914 38.095,49.949 L44.839,67.966 C44.9805402,68.3515748 45.3094513,68.6379726 45.7108281,68.7251403 C46.1122049,68.812308 46.5302805,68.6881345 46.819,68.396 L49.963,65.256 L54.913,70.2 C55.1381622,70.4259454 55.4440182,70.5529463 55.763,70.5529463 C56.0819818,70.5529463 56.3878378,70.4259454 56.613,70.2 L59.913,66.9 C60.1404834,66.6746413 60.2684624,66.3677113 60.2684624,66.0475 C60.2684624,65.7272887 60.1404834,65.4203587 59.913,65.195 L54.97,60.253 Z M55.765,67.643 L50.815,62.698 C50.5898378,62.4720546 50.2839818,62.3450537 49.965,62.3450537 C49.6460182,62.3450537 49.3401622,62.4720546 49.115,62.698 L46.443,65.366 L41.28,51.58 L55.08,56.735 L52.412,59.4 C52.1857516,59.6260167 52.0586271,59.9327002 52.0586271,60.2525 C52.0586271,60.5722998 52.1857516,60.8789833 52.412,61.105 L57.36,66.048 L55.765,67.643 Z" id="Path_435" fill="#0075A3"></path>
            <path d="M35.195,5.332 L35.195,3.665 L33.529,3.665 C33.1609022,3.665 32.8625,3.36659779 32.8625,2.9985 C32.8625,2.63040221 33.1609022,2.332 33.529,2.332 L35.196,2.332 L35.196,0.666 C35.196,0.298178357 35.4941784,0 35.862,0 C36.2298216,0 36.528,0.298178357 36.528,0.666 L36.528,2.332 L38.195,2.332 C38.5630978,2.332 38.8615,2.63040221 38.8615,2.9985 C38.8615,3.36659779 38.5630978,3.665 38.195,3.665 L36.528,3.665 L36.528,5.332 C36.528,5.69982164 36.2298216,5.998 35.862,5.998 C35.4941784,5.998 35.196,5.69982164 35.196,5.332 L35.195,5.332 Z" id="Union_8" fill="#B2E0F3"></path>
            <circle id="Ellipse_15" fill="#0075A3" cx="21.362" cy="18.5" r="1.5"></circle>
            <path d="M3.334,65.88 L3.334,64.213 L1.667,64.213 C1.42272473,64.2224637 1.19284383,64.0975399 1.06789221,63.8874279 C0.942940593,63.6773159 0.942940593,63.4156841 1.06789221,63.2055721 C1.19284383,62.9954601 1.42272473,62.8705363 1.667,62.88 L3.334,62.88 L3.334,61.214 C3.334,60.8461784 3.63217836,60.548 4,60.548 C4.36782164,60.548 4.666,60.8461784 4.666,61.214 L4.666,62.88 L6.333,62.88 C6.57727527,62.8705363 6.80715617,62.9954601 6.93210779,63.2055721 C7.05705941,63.4156841 7.05705941,63.6773159 6.93210779,63.8874279 C6.80715617,64.0975399 6.57727527,64.2224637 6.333,64.213 L4.662,64.213 L4.662,65.88 C4.662,66.2478216 4.36382164,66.546 3.996,66.546 C3.62817836,66.546 3.33,66.2478216 3.33,65.88 L3.334,65.88 Z" id="Union_9" fill="#0075A3"></path>
            <circle id="Ellipse_16" fill="#B2E0F3" cx="87.362" cy="46.5" r="1.5"></circle>
            <path d="M5.318,36.202 L4.156,36.372 L4.135,36.372 C4.07183314,36.3889444 4.02261423,36.4384775 4.00607217,36.5017509 C3.9895301,36.5650243 4.00820857,36.6323084 4.055,36.678 L4.896,37.497 L4.696,38.654 L4.696,38.674 C4.69231152,38.7395793 4.72424463,38.8020582 4.77955617,38.8374825 C4.83486772,38.8729067 4.90497542,38.8757797 4.963,38.845 L6.003,38.298 L7.042,38.844 L7.06,38.853 C7.12100872,38.8765431 7.18995831,38.8655459 7.24061631,38.8241925 C7.29127431,38.782839 7.31585254,38.7174869 7.305,38.653 L7.105,37.496 L7.946,36.677 L7.96,36.662 C8.00136155,36.6111827 8.01221492,36.5420548 7.98841666,36.4810071 C7.96461839,36.4199594 7.90984229,36.3764159 7.845,36.367 L6.683,36.197 L6.162,35.148 C6.1312565,35.0861052 6.06810958,35.046963 5.999,35.046963 C5.92989042,35.046963 5.8667435,35.0861052 5.836,35.148 L5.318,36.202 Z" id="Path_383" fill="#58A9CB"></path>
            <path d="M78.977,24.778 L77.234,25.033 L77.202,25.039 C77.1072497,25.0644166 77.0334213,25.1387162 77.0086082,25.2336263 C76.9837951,25.3285364 77.0118129,25.4294625 77.082,25.498 L78.343,26.726 L78.043,28.461 L78.043,28.491 C78.0373828,28.5893091 78.0851428,28.6830251 78.1679867,28.7362523 C78.2508305,28.7894794 78.3559188,28.7939685 78.443,28.748 L80.002,27.928 L81.56,28.747 L81.587,28.76 C81.6785693,28.7955576 81.7821816,28.7791788 81.8583185,28.7171107 C81.9344554,28.6550426 81.9713766,28.556856 81.955,28.46 L81.655,26.725 L82.916,25.497 L82.937,25.474 C82.9987576,25.3978443 83.0149323,25.294419 82.9793747,25.2030442 C82.9438171,25.1116695 82.8619891,25.0463809 82.765,25.032 L81.022,24.777 L80.243,23.198 C80.1968848,23.1051577 80.1021644,23.0464444 79.9985,23.0464444 C79.8948356,23.0464444 79.8001152,23.1051577 79.754,23.198 L78.977,24.778 Z" id="Path_384" fill="#0075A3"></path>
        </g>
    </g>
</svg>