<svg width="45" height="40" viewBox="0 0 45 40" fill="none" xmlns="http://www.w3.org/2000/svg">
<path d="M37.1201 17.3456C38.7477 21.8191 38.2909 29.9086 30.03 32.6865C22.6604 35.1664 7.56329 32.7399 6.07229 28.6418C4.65891 24.7571 -0.859977 15.5075 6.05752 12.5729C11.1269 10.4219 26.9914 0.392964 34.4033 2.25977C38.8074 3.36776 36.4721 15.5646 37.1201 17.3456Z" fill="#ADDBEF" fill-opacity="0.4"/>
<path d="M20.0725 2.16945V1.49119H19.3942C19.3586 1.49119 19.3234 1.48418 19.2905 1.47055C19.2576 1.45692 19.2277 1.43695 19.2025 1.41176C19.1773 1.38658 19.1573 1.35669 19.1437 1.32379C19.1301 1.29089 19.123 1.25562 19.123 1.22001C19.123 1.1844 19.1301 1.14913 19.1437 1.11623C19.1573 1.08333 19.1773 1.05344 19.2025 1.02826C19.2277 1.00307 19.2576 0.9831 19.2905 0.969472C19.3234 0.955843 19.3586 0.948829 19.3942 0.948829H20.0725V0.270978C20.0725 0.19911 20.101 0.130186 20.1519 0.0793675C20.2027 0.0285494 20.2716 0 20.3435 0C20.4153 0 20.4843 0.0285494 20.5351 0.0793675C20.5859 0.130186 20.6144 0.19911 20.6144 0.270978V0.948829H21.2927C21.3283 0.948829 21.3636 0.955843 21.3965 0.969472C21.4294 0.9831 21.4593 1.00307 21.4845 1.02826C21.5096 1.05344 21.5296 1.08333 21.5432 1.11623C21.5569 1.14913 21.5639 1.1844 21.5639 1.22001C21.5639 1.25562 21.5569 1.29089 21.5432 1.32379C21.5296 1.35669 21.5096 1.38658 21.4845 1.41176C21.4593 1.43695 21.4294 1.45692 21.3965 1.47055C21.3636 1.48418 21.3283 1.49119 21.2927 1.49119H20.6144V2.16945C20.6144 2.24132 20.5859 2.31024 20.5351 2.36106C20.4843 2.41188 20.4153 2.44043 20.3435 2.44043C20.2716 2.44043 20.2027 2.41188 20.1519 2.36106C20.101 2.31024 20.0725 2.24132 20.0725 2.16945Z" fill="#B2E0F3"/>
<path d="M7.93404 6.91691C8.27111 6.91691 8.54435 6.64366 8.54435 6.3066C8.54435 5.96953 8.27111 5.69629 7.93404 5.69629C7.59698 5.69629 7.32373 5.96953 7.32373 6.3066C7.32373 6.64366 7.59698 6.91691 7.93404 6.91691Z" fill="#0075A3"/>
<path d="M4.66726 27.6187V26.9404H3.98941C3.95291 26.9418 3.91651 26.9359 3.88237 26.9229C3.84824 26.9099 3.81708 26.8901 3.79076 26.8648C3.76444 26.8395 3.7435 26.8091 3.72919 26.7755C3.71489 26.7419 3.70752 26.7058 3.70752 26.6692C3.70752 26.6327 3.71489 26.5966 3.72919 26.563C3.7435 26.5293 3.76444 26.499 3.79076 26.4737C3.81708 26.4483 3.84824 26.4286 3.88237 26.4156C3.91651 26.4026 3.95291 26.3966 3.98941 26.398H4.66767V25.7202C4.66767 25.6483 4.69622 25.5794 4.74704 25.5286C4.79785 25.4778 4.86678 25.4492 4.93865 25.4492C5.01051 25.4492 5.07944 25.4778 5.13026 25.5286C5.18107 25.5794 5.20962 25.6483 5.20962 25.7202V26.398H5.88788C5.95799 26.4008 6.02431 26.4305 6.07295 26.4811C6.12159 26.5316 6.14876 26.5991 6.14876 26.6692C6.14876 26.7394 6.12159 26.8068 6.07295 26.8574C6.02431 26.9079 5.95799 26.9377 5.88788 26.9404H5.20922V27.6187C5.20922 27.6905 5.18067 27.7595 5.12985 27.8103C5.07903 27.8611 5.01011 27.8896 4.93824 27.8896C4.86637 27.8896 4.79745 27.8611 4.74663 27.8103C4.69581 27.7595 4.66726 27.6905 4.66726 27.6187Z" fill="#0075A3"/>
<path d="M41.2978 19.5302C41.6349 19.5302 41.9081 19.2569 41.9081 18.9199C41.9081 18.5828 41.6349 18.3096 41.2978 18.3096C40.9607 18.3096 40.6875 18.5828 40.6875 18.9199C40.6875 19.2569 40.9607 19.5302 41.2978 19.5302Z" fill="#B2E0F3"/>
<path d="M34.0302 4.90128C34.3673 4.90128 34.6405 4.62804 34.6405 4.29097C34.6405 3.95391 34.3673 3.68066 34.0302 3.68066C33.6932 3.68066 33.4199 3.95391 33.4199 4.29097C33.4199 4.62804 33.6932 4.90128 34.0302 4.90128Z" fill="white"/>
<path d="M19.79 32.9755C20.1271 32.9755 20.4003 32.7023 20.4003 32.3652C20.4003 32.0281 20.1271 31.7549 19.79 31.7549C19.4529 31.7549 19.1797 32.0281 19.1797 32.3652C19.1797 32.7023 19.4529 32.9755 19.79 32.9755Z" fill="white"/>
<path d="M8.18389 18.2193L7.47471 18.3231L7.46169 18.3255C7.44275 18.3306 7.4255 18.3406 7.41168 18.3545C7.39786 18.3684 7.38797 18.3857 7.38301 18.4047C7.37805 18.4237 7.3782 18.4436 7.38344 18.4625C7.38869 18.4814 7.39884 18.4986 7.41287 18.5123L7.92593 19.0119L7.80387 19.7179V19.7301C7.80275 19.7497 7.80687 19.7693 7.8158 19.7868C7.82474 19.8044 7.83817 19.8192 7.85473 19.8298C7.87128 19.8405 7.89037 19.8465 7.91003 19.8474C7.92969 19.8482 7.94922 19.8438 7.96662 19.8346L8.60053 19.501L9.23444 19.8342L9.24543 19.8395C9.26373 19.8466 9.28358 19.8487 9.30298 19.8457C9.32237 19.8426 9.3406 19.8345 9.35582 19.8221C9.37104 19.8097 9.38269 19.7934 9.3896 19.7751C9.39651 19.7567 9.39843 19.7368 9.39516 19.7174L9.27309 19.0115L9.78697 18.5131L9.79552 18.5037C9.80786 18.4885 9.81596 18.4703 9.81899 18.4509C9.82202 18.4316 9.81987 18.4118 9.81276 18.3935C9.80565 18.3752 9.79384 18.3592 9.77852 18.347C9.7632 18.3347 9.74492 18.3268 9.72554 18.3239L9.01636 18.2201L8.6994 17.5773C8.6902 17.5588 8.67602 17.5432 8.65844 17.5323C8.64087 17.5214 8.6206 17.5156 8.59992 17.5156C8.57924 17.5156 8.55898 17.5214 8.5414 17.5323C8.52382 17.5432 8.50964 17.5588 8.50044 17.5773L8.18389 18.2193Z" fill="#58A9CB"/>
<path d="M37.886 10.0816L37.1769 10.1854L37.1638 10.1878C37.1449 10.1929 37.1276 10.2029 37.1138 10.2168C37.1 10.2307 37.0901 10.2481 37.0852 10.267C37.0802 10.286 37.0803 10.3059 37.0856 10.3248C37.0908 10.3437 37.101 10.3609 37.115 10.3746L37.6281 10.8742L37.506 11.5802V11.5924C37.5049 11.612 37.509 11.6316 37.518 11.6491C37.5269 11.6667 37.5403 11.6815 37.5569 11.6921C37.5734 11.7028 37.5925 11.7088 37.6122 11.7097C37.6318 11.7105 37.6514 11.7061 37.6688 11.6969L38.3023 11.3633L38.9362 11.6965L38.9472 11.7018C38.9655 11.7089 38.9853 11.711 39.0047 11.708C39.0241 11.7049 39.0423 11.6968 39.0576 11.6844C39.0728 11.672 39.0844 11.6557 39.0913 11.6374C39.0983 11.619 39.1002 11.5991 39.0969 11.5797L38.9748 10.8738L39.4883 10.3754L39.4969 10.366C39.5092 10.3508 39.5173 10.3326 39.5203 10.3132C39.5234 10.2939 39.5212 10.2741 39.5141 10.2558C39.507 10.2375 39.4952 10.2215 39.4799 10.2093C39.4645 10.197 39.4463 10.1891 39.4269 10.1862L38.7177 10.0825L38.4011 9.43959C38.3919 9.42107 38.3778 9.40549 38.3602 9.3946C38.3426 9.3837 38.3223 9.37793 38.3017 9.37793C38.281 9.37793 38.2607 9.3837 38.2431 9.3946C38.2256 9.40549 38.2114 9.42107 38.2022 9.43959L37.886 10.0816Z" fill="#0075A3"/>
<path d="M13.3209 6.50977H30.0027C30.2725 6.50977 30.5312 6.61693 30.722 6.80769C30.9127 6.99845 31.0199 7.25718 31.0199 7.52695V28.2775C31.0199 28.5473 30.9127 28.806 30.722 28.9968C30.5312 29.1875 30.2725 29.2947 30.0027 29.2947H13.3209C13.0511 29.2947 12.7924 29.1875 12.6016 28.9968C12.4109 28.806 12.3037 28.5473 12.3037 28.2775V7.52695C12.3037 7.25718 12.4109 6.99845 12.6016 6.80769C12.7924 6.61693 13.0511 6.50977 13.3209 6.50977Z" fill="#B2E0F3"/>
<path d="M12.2271 6.50977H14.2614V29.2947H12.2271V6.50977Z" fill="#58AACB"/>
<path d="M30.0025 5.69629H13.3207C12.8351 5.69629 12.3694 5.88919 12.026 6.23256C11.6826 6.57592 11.4897 7.04163 11.4897 7.52722V28.2778C11.4897 28.7634 11.6826 29.2291 12.026 29.5724C12.3694 29.9158 12.8351 30.1087 13.3207 30.1087H30.0025C30.4881 30.1087 30.9538 29.9158 31.2972 29.5724C31.6405 29.2291 31.8334 28.7634 31.8334 28.2778V7.52722C31.8334 7.04163 31.6405 6.57592 31.2972 6.23256C30.9538 5.88919 30.4881 5.69629 30.0025 5.69629ZM30.0025 6.51004C30.2723 6.51004 30.531 6.6172 30.7218 6.80796C30.9125 6.99872 31.0197 7.25745 31.0197 7.52722V28.2778C31.0197 28.5475 30.9125 28.8063 30.7218 28.997C30.531 29.1878 30.2723 29.295 30.0025 29.295H13.3207C13.0509 29.295 12.7922 29.1878 12.6014 28.997C12.4107 28.8063 12.3035 28.5475 12.3035 28.2778V7.52722C12.3035 7.25745 12.4107 6.99872 12.6014 6.80796C12.7922 6.6172 13.0509 6.51004 13.3207 6.51004H30.0025Z" fill="#0075A3"/>
<path d="M13.2147 24.4155V25.6044H10.5786V24.4155H13.2147ZM13.2147 19.6771V20.866H10.5786V19.6771H13.2147ZM13.2147 14.9386V16.1275H10.5786V14.9386H13.2147ZM13.2147 10.2002V11.3891H10.5786V10.2006L13.2147 10.2002Z" fill="#0075A3"/>
<path d="M26.2962 25.3071C26.4009 25.2973 26.5065 25.3095 26.6063 25.3429C26.706 25.3763 26.7977 25.4302 26.8754 25.501C26.9532 25.5718 27.0153 25.6581 27.0578 25.7544C27.1003 25.8506 27.1222 25.9546 27.1222 26.0598C27.1222 26.165 27.1003 26.269 27.0578 26.3652C27.0153 26.4614 26.9532 26.5477 26.8754 26.6186C26.7977 26.6894 26.706 26.7432 26.6063 26.7766C26.5065 26.81 26.4009 26.8223 26.2962 26.8125H17.6517C17.547 26.8223 17.4414 26.81 17.3416 26.7766C17.2419 26.7432 17.1502 26.6894 17.0725 26.6186C16.9947 26.5477 16.9326 26.4614 16.8901 26.3652C16.8476 26.269 16.8257 26.165 16.8257 26.0598C16.8257 25.9546 16.8476 25.8506 16.8901 25.7544C16.9326 25.6581 16.9947 25.5718 17.0725 25.501C17.1502 25.4302 17.2419 25.3763 17.3416 25.3429C17.4414 25.3095 17.547 25.2973 17.6517 25.3071H26.2962ZM26.2962 23.2015C26.4009 23.1917 26.5065 23.204 26.6063 23.2374C26.706 23.2707 26.7977 23.3246 26.8754 23.3954C26.9532 23.4663 27.0153 23.5526 27.0578 23.6488C27.1003 23.745 27.1222 23.849 27.1222 23.9542C27.1222 24.0594 27.1003 24.1634 27.0578 24.2596C27.0153 24.3559 26.9532 24.4421 26.8754 24.513C26.7977 24.5838 26.706 24.6377 26.6063 24.6711C26.5065 24.7045 26.4009 24.7167 26.2962 24.7069H17.6517C17.547 24.7167 17.4414 24.7045 17.3416 24.6711C17.2419 24.6377 17.1502 24.5838 17.0725 24.513C16.9947 24.4421 16.9326 24.3559 16.8901 24.2596C16.8476 24.1634 16.8257 24.0594 16.8257 23.9542C16.8257 23.849 16.8476 23.745 16.8901 23.6488C16.9326 23.5526 16.9947 23.4663 17.0725 23.3954C17.1502 23.3246 17.2419 23.2707 17.3416 23.2374C17.4414 23.204 17.547 23.1917 17.6517 23.2015H26.2962Z" fill="white"/>
<path d="M24.0463 13.224C24.0517 13.5706 23.9877 13.9147 23.858 14.2362C23.7283 14.5576 23.5356 14.8498 23.2911 15.0956C23.0575 15.344 22.7748 15.5413 22.4609 15.6748C22.1471 15.8083 21.8089 15.8751 21.4679 15.8711C21.1267 15.8752 20.7884 15.8084 20.4744 15.6749C20.1605 15.5414 19.8776 15.3441 19.6439 15.0956C19.1591 14.5931 18.8882 13.9222 18.8882 13.224C18.8882 12.5258 19.1591 11.8548 19.6439 11.3523C19.8776 11.1045 20.1602 10.9078 20.4738 10.7747C20.7874 10.6416 21.1252 10.5751 21.4659 10.5793C21.8069 10.5753 22.145 10.6422 22.4589 10.7757C22.7727 10.9092 23.0554 11.1064 23.2891 11.3548C23.5336 11.6001 23.7266 11.8918 23.8566 12.2128C23.9867 12.5338 24.0511 12.8776 24.0463 13.224Z" fill="white"/>
<path d="M26.0401 19.6706C26.0517 19.9251 26.0108 20.1793 25.9198 20.4174C25.8288 20.6554 25.6897 20.8721 25.5111 21.0539C25.3293 21.2256 25.115 21.3592 24.8808 21.4469C24.6466 21.5346 24.3972 21.5746 24.1473 21.5646H18.98C18.7304 21.5744 18.4813 21.5344 18.2474 21.4467C18.0135 21.359 17.7994 21.2255 17.6178 21.0539C17.4393 20.8721 17.3001 20.6554 17.2091 20.4174C17.1181 20.1793 17.0772 19.9251 17.0889 19.6706C17.0889 19.4496 17.0962 19.2307 17.1104 19.0196C17.1272 18.7861 17.1563 18.5538 17.1975 18.3234C17.238 18.0869 17.2936 17.8533 17.3639 17.624C17.4352 17.3981 17.5291 17.18 17.6442 16.973C17.7568 16.7652 17.8986 16.5748 18.0654 16.4074C18.2401 16.2385 18.4464 16.1055 18.6724 16.016C18.9184 15.9186 19.1809 15.8697 19.4455 15.872C19.6007 15.8891 19.7471 15.9528 19.8654 16.0547C19.9931 16.1401 20.1404 16.2378 20.3032 16.3444C20.4814 16.4536 20.6728 16.5397 20.8728 16.6007C21.0741 16.6684 21.2842 16.7066 21.4965 16.7142C21.5193 16.7142 21.5421 16.7142 21.5649 16.7142C21.8001 16.7132 22.0336 16.6745 22.2566 16.5995C22.4552 16.5383 22.6454 16.4524 22.8225 16.3435C22.9853 16.2357 23.1342 16.1401 23.2603 16.0539C23.3786 15.952 23.525 15.8883 23.6802 15.8712C23.9448 15.8689 24.2073 15.9178 24.4533 16.0152C24.6793 16.1047 24.8855 16.2377 25.0603 16.4066C25.2276 16.5737 25.3698 16.764 25.4827 16.9718C25.5979 17.1787 25.6918 17.3968 25.763 17.6228C25.8335 17.8522 25.8892 18.086 25.9298 18.3226C25.9708 18.5528 25.9997 18.7851 26.0165 19.0183C26.0311 19.2279 26.038 19.4468 26.0385 19.6693L26.0401 19.6706Z" fill="#0075A3"/>
<path d="M21.5166 15.8723V10.5793C21.8575 10.5753 22.1955 10.6422 22.5092 10.7757C22.8229 10.9092 23.1055 11.1064 23.339 11.3548C23.8236 11.8573 24.0944 12.5282 24.0944 13.2264C24.0944 13.9245 23.8236 14.5954 23.339 15.098C23.1054 15.3462 22.8228 15.5432 22.5091 15.6765C22.1954 15.8098 21.8574 15.8764 21.5166 15.8723Z" fill="#B2E0F3" fill-opacity="0.45"/>
<path d="M26.0401 19.67C26.0563 19.9221 26.0188 20.1748 25.93 20.4113C25.8411 20.6478 25.7031 20.8627 25.5249 21.0418C25.3467 21.2209 25.1325 21.3601 24.8965 21.4501C24.6605 21.5401 24.408 21.579 24.1558 21.564H21.5156V16.7133C21.5384 16.7133 21.5612 16.7133 21.584 16.7133C21.8184 16.7123 22.0511 16.6736 22.2732 16.5985C22.4711 16.5374 22.6605 16.4514 22.8367 16.3426C22.9995 16.2348 23.1472 16.1392 23.2725 16.0529C23.3902 15.951 23.5361 15.8873 23.6908 15.8702C23.9554 15.8675 24.218 15.9164 24.4638 16.0143C24.6889 16.1039 24.8942 16.2369 25.068 16.4057C25.2347 16.5728 25.3764 16.7632 25.4887 16.9708C25.6035 17.1779 25.697 17.396 25.7679 17.6218C25.8381 17.8513 25.8935 18.0851 25.9339 18.3216C25.9746 18.5519 26.0034 18.7841 26.0201 19.0174C26.0344 19.2269 26.0417 19.4458 26.0417 19.6684L26.0401 19.67Z" fill="#00658D"/>
<path d="M31.3294 17.9023C31.1225 17.9021 30.9184 17.9491 30.7324 18.0396C30.5464 18.1301 30.3835 18.2619 30.2561 18.4248L25.918 23.9757C25.7612 24.1759 25.6645 24.4164 25.6391 24.6694C25.6136 24.9224 25.6605 25.1773 25.7743 25.4047L25.815 25.48C25.935 25.6853 26.1068 25.8556 26.3132 25.9739C26.5196 26.0921 26.7534 26.1541 26.9913 26.1537H28.3372V30.3864C28.3378 30.5643 28.3734 30.7403 28.442 30.9044C28.5106 31.0686 28.6108 31.2175 28.737 31.3429C28.8632 31.4682 29.0129 31.5674 29.1775 31.6349C29.3421 31.7024 29.5183 31.7367 29.6962 31.736H32.9622H33.0362C33.382 31.7182 33.7077 31.5686 33.9465 31.318C34.1853 31.0673 34.3189 30.7347 34.3199 30.3885V26.1529H35.6667C35.919 26.1534 36.1664 26.0836 36.3812 25.9513C36.5961 25.8191 36.7699 25.6297 36.8832 25.4043C36.997 25.1769 37.0439 24.922 37.0185 24.669C36.9931 24.416 36.8964 24.1755 36.7396 23.9753L32.4023 18.4244C32.2749 18.2616 32.112 18.13 31.9261 18.0395C31.7402 17.9491 31.5361 17.9021 31.3294 17.9023ZM31.3294 18.7161C31.4032 18.716 31.4763 18.7308 31.5442 18.7596C31.6122 18.7884 31.6736 18.8306 31.7249 18.8837L31.7611 18.9244L36.0988 24.4766C36.1607 24.5555 36.1989 24.6503 36.209 24.7501C36.2191 24.8499 36.2006 24.9505 36.1557 25.0401C36.1144 25.1219 36.0531 25.1919 35.9775 25.2437C35.9019 25.2955 35.8144 25.3273 35.7232 25.3363L35.6671 25.3392H34.051C33.9172 25.3382 33.7879 25.3869 33.6879 25.4757C33.5879 25.5645 33.5243 25.6872 33.5094 25.8201L33.5066 25.875V30.3864C33.5057 30.52 33.4552 30.6484 33.365 30.7469C33.2748 30.8454 33.1513 30.9069 33.0183 30.9194L32.9626 30.9223H29.6962C29.5625 30.9232 29.4331 30.8746 29.3331 30.7858C29.2331 30.697 29.1695 30.5743 29.1547 30.4414L29.1518 30.3864V25.8771C29.1509 25.7435 29.1004 25.6151 29.0102 25.5166C28.92 25.4181 28.7965 25.3567 28.6636 25.3441L28.6078 25.3412H26.9917C26.8906 25.3415 26.7914 25.3137 26.7052 25.2609C26.619 25.2081 26.5491 25.1324 26.5035 25.0422C26.4632 24.9618 26.444 24.8724 26.4479 24.7826C26.4517 24.6927 26.4784 24.6053 26.5254 24.5287L26.5604 24.4786L30.8977 18.9256C30.949 18.8602 31.0146 18.8073 31.0894 18.771C31.1642 18.7347 31.2462 18.7159 31.3294 18.7161Z" fill="#0075A3"/>
<path d="M31.3296 30.9219H32.9628C33.106 30.923 33.2438 30.8671 33.3459 30.7667C33.448 30.6662 33.506 30.5293 33.5072 30.386V25.8767C33.5084 25.7334 33.5664 25.5965 33.6684 25.496C33.7705 25.3956 33.9083 25.3397 34.0516 25.3408H35.6677C35.7688 25.3411 35.868 25.3133 35.9542 25.2605C36.0404 25.2077 36.1103 25.132 36.1559 25.0417C36.2008 24.9521 36.2193 24.8515 36.2092 24.7517C36.1991 24.6519 36.1609 24.5571 36.099 24.4782L31.7613 18.9252C31.7098 18.86 31.6443 18.8072 31.5695 18.7709C31.4947 18.7347 31.4127 18.7158 31.3296 18.7158C31.2465 18.7158 31.1645 18.7347 31.0897 18.7709C31.0149 18.8072 30.9493 18.86 30.8979 18.9252L26.5602 24.4762C26.4983 24.5551 26.46 24.6499 26.4499 24.7497C26.4399 24.8495 26.4583 24.95 26.5032 25.0397C26.5489 25.1299 26.6187 25.2057 26.705 25.2585C26.7912 25.3113 26.8904 25.3391 26.9915 25.3388H28.6076C28.6787 25.3382 28.7493 25.3516 28.8152 25.3784C28.8811 25.4051 28.9411 25.4446 28.9917 25.4946C29.0423 25.5445 29.0826 25.604 29.1101 25.6696C29.1377 25.7352 29.1521 25.8055 29.1524 25.8767V30.386C29.1536 30.5292 29.2115 30.666 29.3135 30.7665C29.4155 30.867 29.5532 30.9229 29.6964 30.9219H31.3296Z" fill="white"/>
</svg>
