<svg xmlns="http://www.w3.org/2000/svg" width="54" height="54" viewBox="0 0 54 54">
  <g id="Green-CheckMark" transform="translate(6336 -2000.5)">
    <circle id="Oval" cx="27" cy="27" r="27" transform="translate(-6336 2000.5)" fill="#208837" />
    <path id="Path_16"
          d="M24.228,0l-2.61,2.721-10.5,10.5-3.06-2.949L5.328,7.56,0,12.9l2.721,2.7L8.4,21.279,11,24l2.721-2.721,13.23-13.23L29.67,5.328Z"
          transform="translate(-6324 2015.5)" fill="#fff" />
  </g>
</svg>
