<svg id="Success-Message-Icon" xmlns="http://www.w3.org/2000/svg" width="110.074" height="98.312" viewBox="0 0 110.074 98.312">
  <path id="Path_376" d="M91.282,55.4c0,11.7-7.853,30-29.267,29.474C42.91,84.409,10.08,66.118,10.08,55.4c0-10.16-4.974-36.161,13.469-37.126,13.516-.708,58.585-10.54,74.135,0C106.925,24.534,91.282,50.742,91.282,55.4Z" transform="translate(-13.49 21.78) rotate(-19.993)" fill="rgba(173,219,239,0.4)"/>
  <path id="Union_8" d="M49.333,5.332V3.665H47.666a.666.666,0,1,1,0-1.333h1.667V.666a.666.666,0,0,1,1.332,0V2.332h1.667a.666.666,0,1,1,0,1.333H50.665V5.332a.666.666,0,0,1-1.332,0Z" transform="translate(0 0)" fill="#b2e0f3"/>
  <circle id="Ellipse_15" cx="1.5" cy="1.5" r="1.5" transform="translate(18 14)" fill="#0075a3"/>
  <path id="Union_9" d="M11.472,67.88V66.213H9.8a.667.667,0,1,1,0-1.333h1.667V63.214a.666.666,0,1,1,1.332,0V64.88h1.667a.667.667,0,1,1,0,1.333H12.8V67.88a.666.666,0,1,1-1.332,0Z" transform="translate(0 0)" fill="#d42f30"/>
  <circle id="Ellipse_16" cx="1.5" cy="1.5" r="1.5" transform="translate(100 45)" fill="#b2e0f3"/>
  <circle id="Ellipse_17" cx="1.5" cy="1.5" r="1.5" transform="translate(82.139 9.047)" fill="#fff"/>
  <circle id="Ellipse_18" cx="1.5" cy="1.5" r="1.5" transform="translate(47.139 78.047)" fill="#fff"/>
  <path id="Path_383" d="M10.977,32.732l-1.743.255-.032.006a.273.273,0,0,0-.12.459l1.261,1.228-.3,1.735v.03a.273.273,0,0,0,.4.257L12,35.882l1.558.819.027.013a.273.273,0,0,0,.368-.3l-.3-1.735,1.261-1.228.021-.023a.273.273,0,0,0-.172-.442l-1.743-.255-.779-1.579a.273.273,0,0,0-.489,0Z" transform="translate(0 0)" fill="rgba(212,47,48,0.5)"/>
  <path id="Path_384" d="M93.115,24.778l-1.743.255-.032.006a.273.273,0,0,0-.12.459l1.261,1.228-.3,1.735v.03a.273.273,0,0,0,.4.257l1.559-.82,1.558.819.027.013a.273.273,0,0,0,.368-.3l-.3-1.735L97.054,25.5l.021-.023a.273.273,0,0,0-.172-.442l-1.743-.255L94.381,23.2a.273.273,0,0,0-.489,0Z" transform="translate(0 0)" fill="#d42f30"/>
  <circle id="Ellipse_23" data-name="Ellipse 23" cx="32" cy="32" r="32" transform="translate(21 13)" fill="#b2e0f3"/>
  <g id="Ellipse_24" data-name="Ellipse 24" transform="translate(35.5 26)" fill="#d42f30" stroke="#d42f30" stroke-width="1">
    <circle cx="18.5" cy="18.5" r="18.5" stroke="none"/>
    <circle cx="18.5" cy="18.5" r="18" fill="none"/>
  </g>
  <path id="Combined-Shape" d="M3.537,1.127l.139.125,4.959,4.96L13.6,1.252a1.714,1.714,0,0,1,2.549,2.285l-.125.139-4.96,4.959,4.96,4.959a1.714,1.714,0,0,1-2.285,2.549l-.139-.125-4.959-4.96-4.959,4.96a1.714,1.714,0,0,1-2.549-2.285l.125-.139,4.96-4.959L1.252,3.676A1.714,1.714,0,0,1,3.537,1.127Z" transform="translate(45.731 36.231)" fill="#fff"/>
</svg>
