7
0
0
1
2
4
6
7
0
3
0
5
1
4
9
23
25
23
32
141
93
59
58
22
51
93
51
183
166
85
356
51
17
62
67
186
110
78
75
92
128
138
111
293
190
206
125
76
223
384
427
349
206
428
448
338
224
381
310
406
359
472
425
438
422
299
500
534
571
660
591
508
635
412
792
1024
1105
1163
1295
990
1298
1513
1359
1330
1320
1282
1007
1366
1501
1877
2137
2134
2224
1647
1859
2414
2877
3137
3630
3000
2909
3947
3788
3390
3460
2948
2889
2084
2199
2442
2373
2520
2505
2244
1379
2008
2033
2187
2089
1781
1573
1246
1606
1647
1652
1462
1475
1211
954
1349
1227
1041
1025
