{
  "name": "Car",
  "fields": [
    {
      "fieldName": "name",
      "fieldType": "String",
      "fieldValidateRules": [
        "required"
      ]
    },
    {
      "fieldName": "model",
      "fieldType": "String",
      "fieldValidateRules": [
        "required"
      ]
    },
    {
      "fieldName": "capacity",
      "fieldType": "Integer",
      "fieldValidateRules": [
        "min"
      ],
      "fieldValidateRulesMin": "1"
    },
    {
      "fieldName": "registrationNumber",
      "fieldType": "String",
      "fieldValidateRules": [
        "required"
      ]
    },
    {
      "fieldName": "rate",
      "fieldType": "Integer",
      "fieldValidateRules": [
        "min"
      ],
      "fieldValidateRulesMin": "1"
    },
    {
      "fieldName": "status",
      "fieldType": "Status",
      "fieldValues": "BOOKED,FREE"
    },
    {
      "fieldName": "image",
      "fieldType": "byte[]",
      "fieldTypeBlobContent": "image",
      "fieldValidateRules": [
        "required"
      ]
    }
  ],
  "relationships": [
    {
      "relationshipType": "many-to-many",
      "otherEntityName": "booking",
      "otherEntityRelationshipName": "car",
      "relationshipName": "book",
      "otherEntityField": "id",
      "ownerSide": false
    }
  ],
  "changelogDate": "20210221093054",
  "entityTableName": "car",
  "dto": "no",
  "pagination": "infinite-scroll",
  "service": "no",
  "jpaMetamodelFiltering": false,
  "fluentMethods": true,
  "readOnly": false,
  "embedded": false,
  "clientRootFolder": "",
  "applications": "*"
}
