[
    {
        "_id": "",
        "Name": "College Name",
        "ContactInformation": {
            "Address": "",
            "PhoneNumber": "",
            "EmailAddress": ""
        },
        "Website": "",
        "Streams": [],
        "CoursesOffered": [],
        "PlacementCell": {
            "Coordinator": "",
            "ContactInformation": {
                "PhoneNumber": "",
                "EmailAddress": ""
            },
            "Objective": "",
            "PlacementTeam": [
                {
                    "Name": "",
                    "Role": "",
                    "Contact": {
                        "PhoneNumber": "",
                        "Email": ""
                    }
                }
            ],
            "PlacementCalendar": [
                {
                    "Event": "",
                    "Date": "",
                    "Location": ""
                }
            ],
            "CorporateRelations": [
                {
                    "CompanyName": "",
                    "ContactPerson": "",
                    "ContactEmail": "",
                    "RelationshipDetails": ""
                }
            ],
            "PlacementProcess": ""
        },
        "PlacementStatistics": {
            "AcademicYear": "",
            "TotalStudents": 0,
            "StudentsPlaced": 0,
            "PlacementPercentage": 0,
            "AverageSalary": 0,
            "HighestSalary": 0,
            "LowestSalary": 0,
            "TopRecruitingCompanies": [
                {
                    "CompanyName": "",
                    "PlacementCount": 0
                },
                {
                    "CompanyName": "",
                    "PlacementCount": 0
                }
            ],
            "PlacementDetails": [
                {
                    "StudentName": "",
                    "PlacementCompany": "",
                    "SalaryOffered": 0
                },
                {
                    "StudentName": "",
                    "PlacementCompany": "",
                    "SalaryOffered": 0
                }
            ]
        },
        "Corporates": [
            {
                "_id": "",
                "Name": "",
                "Industry": "",
                "Description": "",
                "ContactPerson": "",
                "ContactEmail": "",
                "ContactPhone": "",
                "Location": "",
                "Hq": "",
                "TotalEmployees": 0,
                "HeadHR": "",
                "Ceo": "",
                "Website": "",
                "Products": [
                    {
                        "ProductName": "",
                        "Description": ""
                    }
                ],
                "Services": [
                    {
                        "ServiceName": "",
                        "Description": ""
                    }
                ],
                "SelectionProcess": {
                    "Qualification": "",
                    "BranchElectives": "",
                    "Cgpa": 0,
                    "OnlineTechnicalTest": "",
                    "OfflineTechnicalTest": "",
                    "TechnicalInterviews": [
                        "",
                        ""
                    ],
                    "Gd": "",
                    "HrInterview": "",
                    "Others": ""
                },
                "CompanyDetails": {
                    "OrgStructure": "",
                    "PerformanceCycle": ""
                },
                "HiringIntent": [
                    {
                        "_id": "",
                        "JobDescription": {
                            "Designation": "",
                            "Probation": "",
                            "SalaryFixed": 0,
                            "SalaryVariable": 0,
                            "JoiningBonus": 0,
                            "InsuranceMedical": "",
                            "InsuranceLife": "",
                            "OtherBenefits": [
                                "",
                                ""
                            ],
                            "Ctc": 105000,
                            "ExpectedJoiningDate": "",
                            "OfficeLocation": "",
                            "OnJobTrainingRequired": true,
                            "SpecifyTraining": "",
                            "JobLocation": "",
                            "JobDescriptionText": ""
                        },
                        "CandidatesAttended": [
                            {
                                "_id": "",
                                "CandidateName": "",
                                "CandidateEmail": "",
                                "CandidatePhoneNumber": "",
                                "ResumeLink": ""
                            }
                        ],
                        "CandidatesHired": [
                            {
                                "_id": "",
                                "CandidateName": "",
                                "OfferDetails": {
                                    "OfferId": "",
                                    "OfferDate": "",
                                    "SalaryOffered": 0,
                                    "JoiningDate": ""
                                }
                            }
                        ]
                    }
                ]
            }
        ],
        "BatchDetails": [
            {
                "Year": "",
                "Stream": [
                    {
                        "Name": "CS",
                        "Students": [
                            {
                                "_id": "",
                                "Name": "Student Name",
                                "Qualification": "",
                                "Preferredindustry": "",
                                "Preferredrole": "",
                                "Preferredcompany1": "",
                                "Preferredcompany2": "",
                                "Preferredcompany3": "",
                                "Expectedsalary": "",
                                "Preferredlocation1": "",
                                "Preferredlocation2": "",
                                "Preferredlocation3": "",
                                "Cgpa": "",
                                "Gender": "",
                                "Hometown": "",
                                "Reminders": {
                                    "_id": "",
                                    "UpcomingEvents": [
                                        {
                                            "_id": "",
                                            "EventName": "",
                                            "EventDate": "",
                                            "EventTime": "",
                                            "EventLocation": ""
                                        }
                                    ],
                                    "ApplicationDeadlines": [
                                        {
                                            "_id": "",
                                            "JobTitle": "",
                                            "CompanyName": "",
                                            "DeadlineDate": "",
                                            "ApplicationLink": ""
                                        }
                                    ],
                                    "InterviewSchedules": [
                                        {
                                            "_id": "",
                                            "CompanyName": "",
                                            "InterviewDate": "",
                                            "InterviewTime": "",
                                            "InterviewLocation": ""
                                        }
                                    ]
                                },
                                "Preferences": {
                                    "_id": "",
                                    "CompanyWise": {
                                        "_id": "",
                                        "CompanyName": "",
                                        "PreferredLocations": [
                                            "",
                                            ""
                                        ],
                                        "PreferredIndustries": [
                                            "",
                                            ""
                                        ],
                                        "PreferredRoles": [
                                            "",
                                            ""
                                        ]
                                    },
                                    "RoleWise": {
                                        "_id": "",
                                        "RoleName": "",
                                        "PreferredCompanies": [
                                            "",
                                            ""
                                        ],
                                        "PreferredIndustries": [
                                            "",
                                            ""
                                        ],
                                        "PreferredLocations": [
                                            "",
                                            ""
                                        ]
                                    }
                                }
                            }
                        ]
                    }
                ]
            }
        ],
        "CalendarEvents": {
            "_id": "",
            "EventDetails": [
                {
                    "_id": "",
                    "EventName": "",
                    "EventDate": "",
                    "EventTime": "",
                    "EventLocation": "",
                    "EventDescription": ""
                }
            ]
        }
    },
    {
        "_id": "",
        "UserName": "",
        "Email": "",
        "Password": "",
        "UserType": 1,
        "UserData": {
            "_user": "data which is needed"
        },
        "CreatedAt": "",
        "UpdatedAt": "",
        "IsActive": true,
        "Roles": [
            "user"
        ],
        "Permissions": [
            "read",
            "write"
        ],
        "Tokens": [
            {
                "Token": "",
                "ExpiresAt": ""
            }
        ],
        "RefreshTokens": [
            {
                "Token": "",
                "ExpiresAt": ""
            }
        ]
    }
]