{
  "packageRules": [
    {
      "matchPaths": ["9.4/**"],
      "packageRules": [
        {
          "matchPackagePatterns": ["pluginsGLPI/addressing"],
          "allowedVersions": "<2.9"
        },
        {
          "matchPackagePatterns": ["pluginsGLPI/mreporting"],
          "allowedVersions": "<1.7"
        },
        {
          "matchPackagePatterns": ["pluginsGLPI/news"],
          "allowedVersions": "<1.7"
        },
        {
          "matchPackagePatterns": ["pluginsGLPI/treeview"],
          "allowedVersions": "<1.9"
        },
        {
          "matchPackagePatterns": ["ericferon/glpi-archifun"],
          "allowedVersions": "<2.2"
        },
        {
          "matchPackagePatterns": ["ericferon/glpi-archimap"],
          "allowedVersions": "<2.2"
        },
        {
          "matchPackagePatterns": ["ericferon/glpi-archisw"],
          "allowedVersions": "<2.2"
        },
        {
          "matchPackagePatterns": ["fusioninventory/fusioninventory-for-glpi"],
          "allowedVersions": "=9.4"
        },
        {
          "matchPackagePatterns": ["ticgal/gappessentials"],
          "allowedVersions": "<1.2"
        },
        {
          "matchPackagePatterns": ["tomolimo/mailanalyzer"],
          "allowedVersions": "<2.0"
        },
        {
          "matchPackagePatterns": ["tomolimo/processmaker"],
          "allowedVersions": "<4.0"
        },
        {
          "matchPackagePatterns": ["tomolimo/officeonline"],
          "allowedVersions": "<2.0"
        },
        {
          "matchPackagePatterns": ["InfotelGLPI/environment"],
          "allowedVersions": "<2.4"
        },
        {
          "matchPackagePatterns": ["InfotelGLPI/manufacturersimports"],
          "allowedVersions": "<2.3"
        },
        {
          "matchPackagePatterns": ["InfotelGLPI/mydashboard"],
          "allowedVersions": "<1.8"
        },
        {
          "matchPackagePatterns": ["InfotelGLPI/positions"],
          "allowedVersions": "<5.0"
        },
        {
          "matchPackagePatterns": ["InfotelGLPI/printercounters"],
          "allowedVersions": "<1.7"
        },
        {
          "matchPackagePatterns": ["InfotelGLPI/shellcommands"],
          "allowedVersions": "<3.0"
        },
        {
          "matchPackagePatterns": ["InfotelGLPI/typology"],
          "allowedVersions": "<2.7"
        },
        {
          "matchPackagePatterns": ["InfotelGLPI/webapplications"],
          "allowedVersions": "<3.0"
        }
      ]
    }
  ]
}
