{
  "extends": [
    "gitlab>ATemplates/renovate-presets:containers-renovate",
    "local>akontainers/glpi/plugins//9.4/renovate",
    "local>akontainers/glpi/plugins//9.5/renovate"
  ],
  "packageRules": [
    {
      "matchPackageNames": [
        "ericferon/glpi-archimap",
        "ericferon/glpi-archisw",
        "ericferon/glpi-archifun"
      ],
      "extractVersion": "^v(?<version>.*)$"
    },
    {
      "matchPackageNames": ["fusioninventory/fusioninventory-for-glpi"],
      "extractVersion": "^glpi(?<version>.*)$",
      "versioning": "regex:(?<major>\\d+)\\.(?<minor>\\d+)(\\.\\d+)?\\+(?<patch>\\d+)\\.(?<build>\\d+)"
    },
    {
      "matchPackageNames": ["busybox", "alpine"],
      "automerge": true,
      "platformAutomerge": true,
      "matchUpdateTypes": ["patch", "digest"]
    }
  ],
  "assignees": ["AKorezin"]
}
