module gitlab.com/akki.jura96/rest-cli

go 1.21.2

require (
	github.com/inconshreveable/mousetrap v1.1.0 // indirect
	github.com/spf13/cobra v1.7.0 // indirect
	github.com/spf13/pflag v1.0.5 // indirect
)
