9662 645192
496842 835960
65736 912872
542221 778140
388201 562053
546905 897422
13403 295343
95645 841673
441764 542174
173476 667363
357693 720236
141714 398775
605642 769086
297297 734310
313660 416010
799581 957890
196327 830617
543410 682054
13244 122775
54481 904344
477173 944370
687065 991344
224041 989122
481551 609747
12262 459421
153199 312420
279754 619472
117403 623039
77785 161639
598975 680607
16848 129872
97828 730916
454510 471524
156623 283192
98722 237264
362477 917353
329238 912765
900191 976168
114198 215285
367305 649551
105512 489961
696406 989574
251332 449093
218131 993563
829766 836807
4428 134963
4139 803594
618904 703023
742419 904280
17579 676664
540093 945481
84374 154132
271405 942808
625419 983700
330974 837700
101075 700862
255192 874159
462064 777023
422897 578753
239551 782172
973399 981508
344175 996916
77865 948493
886105 988209
238661 682542
34603 329509
373848 466859
852593 877851
249483 831252
580729 889392
7529 794709
632983 935905
268291 568222
300140 982599
110408 608821
601085 820576
374743 589427
71422 445118
77428 155093
58473 303273
239624 459504
256416 342440
736889 825619
70301 176664
409799 753932
11725 656205
81503 952371
868198 956900
564452 663262
289095 665629
430392 587388
424512 529458
187642 258568
232714 758697
722139 808093
67950 322781
251327 425179
154399 869761
20033 306251
329316 819607
153013 412159
249193 438124
107895 752954
512696 681489
405525 519347
240702 873971
366281 935529
38413 524373
562386 803351
131011 368260
657731 793627
75114 78838
179562 205078
300858 310396
263436 468987
748811 930673
247543 510518
157206 345997
458544 943328
518052 623104
850319 915152
93661 304353
4020 686374
188280 197984
337852 789575
133077 916775
308849 365756
112327 261619
703543 814703
238023 970960
15964 550224
779808 997720
3923 146290
121392 455505
1521 437756
29213 36593
71974 629343
428211 664449
713082 902042
405051 901626
467380 992356
108230 197861
120240 579308
429726 779540
387245 556196
162831 582207
143733 752092
94308 460992
793709 828918
202415 705051
498869 677250
185251 958784
48419 682320
155384 651818
191188 391115
445817 510229
122157 270164
464492 521240
660504 934179
212830 529830
759656 938835
566884 839245
126480 683573
193929 657767
276018 709141
245132 982228
476021 675831
59617 472383
601787 783629
646299 948715
895712 947943
266346 871818
159955 994644
464882 510277
46496 428332
470713 578677
1992 177931
165095 920664
563066 847610
55062 551398
191337 937761
58121 343295
229371 855873
296242 349185
810655 841478
691731 718959
295907 881311
354084 843777
273124 931371
170280 338592
55022 682878
279754 822487
62469 657938
594665 768919
464437 708107
353086 378720
140075 715403
672899 932063
450580 771488
277528 420773
