{
	"info": {
		"_postman_id": "e7791f01-957a-4fd4-a041-914d9d319330",
		"name": "drone",
		"schema": "https://schema.getpostman.com/json/collection/v2.1.0/collection.json",
		"_exporter_id": "16924767"
	},
	"item": [
		{
			"name": "create-drone",
			"request": {
				"method": "POST",
				"header": [],
				"body": {
					"mode": "raw",
					"raw": "{\r\n    \"serialNumber\": \"662226\",\r\n    \"model\": \"MIDDLE\",\r\n    \"weightLimit\": 400\r\n}",
					"options": {
						"raw": {
							"language": "json"
						}
					}
				},
				"url": {
					"raw": "localhost:8080/drone",
					"host": [
						"localhost"
					],
					"port": "8080",
					"path": [
						"drone"
					]
				}
			},
			"response": []
		},
		{
			"name": "drone load",
			"request": {
				"method": "PUT",
				"header": [],
				"body": {
					"mode": "raw",
					"raw": "{\r\n    \"droneId\": \"fae961b9-3141-4251-9738-6344d8cc7717\",\r\n    \"medicationIds\": [\r\n        \"f3efc7a4-ba53-4e18-a1a3-f67c96cd3c68\"\r\n    ]\r\n}",
					"options": {
						"raw": {
							"language": "json"
						}
					}
				},
				"url": {
					"raw": "localhost:8080/drone/load",
					"host": [
						"localhost"
					],
					"port": "8080",
					"path": [
						"drone",
						"load"
					]
				}
			},
			"response": []
		},
		{
			"name": "drone start",
			"request": {
				"method": "POST",
				"header": [],
				"body": {
					"mode": "raw",
					"raw": "{\r\n    \"serialNumber\": \"123fffS\",\r\n    \"model\": \"LIGHT\",\r\n    \"weightLimit\": 350\r\n}",
					"options": {
						"raw": {
							"language": "json"
						}
					}
				},
				"url": {
					"raw": "localhost:8080/drone/start?id=fae961b9-3141-4251-9738-6344d8cc7717",
					"host": [
						"localhost"
					],
					"port": "8080",
					"path": [
						"drone",
						"start"
					],
					"query": [
						{
							"key": "id",
							"value": "fae961b9-3141-4251-9738-6344d8cc7717"
						}
					]
				}
			},
			"response": []
		},
		{
			"name": "drone",
			"protocolProfileBehavior": {
				"disableBodyPruning": true
			},
			"request": {
				"method": "GET",
				"header": [],
				"body": {
					"mode": "raw",
					"raw": "{\r\n    \"serialNumber\": \"123fffS\",\r\n    \"model\": \"LIGHT\",\r\n    \"weightLimit\": 350\r\n}",
					"options": {
						"raw": {
							"language": "json"
						}
					}
				},
				"url": {
					"raw": "localhost:8080/drone/fae961b9-3141-4251-9738-6344d8cc7717",
					"host": [
						"localhost"
					],
					"port": "8080",
					"path": [
						"drone",
						"fae961b9-3141-4251-9738-6344d8cc7717"
					]
				}
			},
			"response": []
		},
		{
			"name": "create-medication",
			"request": {
				"method": "POST",
				"header": [],
				"body": {
					"mode": "formdata",
					"formdata": [
						{
							"key": "data",
							"value": "{\"body\": {\"name\": \"asdcf\",  \"weight\": 100, \"code\": \"AZ_-A\"}}",
							"contentType": "application/json",
							"type": "text"
						},
						{
							"key": "image",
							"type": "file",
							"src": "/C:/Users/ilyas/Desktop/signature.jpg"
						}
					]
				},
				"url": {
					"raw": "localhost:8080/medication/",
					"host": [
						"localhost"
					],
					"port": "8080",
					"path": [
						"medication",
						""
					]
				}
			},
			"response": []
		},
		{
			"name": "get medication",
			"request": {
				"method": "GET",
				"header": [],
				"url": {
					"raw": "localhost:8080/medication/f3efc7a4-ba53-4e18-a1a3-f67c96cd3c68",
					"host": [
						"localhost"
					],
					"port": "8080",
					"path": [
						"medication",
						"f3efc7a4-ba53-4e18-a1a3-f67c96cd3c68"
					]
				}
			},
			"response": []
		},
		{
			"name": "get medication all",
			"request": {
				"method": "GET",
				"header": [],
				"url": {
					"raw": "localhost:8080/medication",
					"host": [
						"localhost"
					],
					"port": "8080",
					"path": [
						"medication"
					]
				}
			},
			"response": []
		},
		{
			"name": "get events all",
			"request": {
				"method": "GET",
				"header": [],
				"url": {
					"raw": "localhost:8080/events?page=1&pageSize=5",
					"host": [
						"localhost"
					],
					"port": "8080",
					"path": [
						"events"
					],
					"query": [
						{
							"key": "page",
							"value": "1"
						},
						{
							"key": "pageSize",
							"value": "5"
						}
					]
				}
			},
			"response": []
		},
		{
			"name": "get events by entityId",
			"request": {
				"method": "GET",
				"header": [],
				"url": {
					"raw": "localhost:8080/events/entity?id=6a6b384d-0adb-4a5b-abb6-ce1c4125c9d8",
					"host": [
						"localhost"
					],
					"port": "8080",
					"path": [
						"events",
						"entity"
					],
					"query": [
						{
							"key": "id",
							"value": "6a6b384d-0adb-4a5b-abb6-ce1c4125c9d8"
						}
					]
				}
			},
			"response": []
		}
	]
}