# Blender MTL File: 'shed.blend'
# Material Count: 8

newmtl Material.002
Ns 96.078431
Ka 0.000000 0.000000 0.000000
Kd 0.640000 0.640000 0.640000
Ks 0.500000 0.500000 0.500000
Ni -1.5
d 1.000000
illum 2
map_Kd pwb.bmp

newmtl Material.003
Ns 96.078431
Ka 0.000000 0.000000 0.000000
Kd 0.640000 0.640000 0.640000
Ks 0.500000 0.500000 0.500000
Ni -1.5
d 1.000000
illum 2

newmtl Material.005
Ns 96.078431
Ka 0.000000 0.000000 0.000000
Kd 0.640000 0.640000 0.640000
Ks 0.500000 0.500000 0.500000
Ni -1.5
d 1.000000
illum 2
map_Kd tin.bmp

newmtl Material.006
Ns 96.078431
Ka 0.000000 0.000000 0.000000
Kd 0.640000 0.640000 0.640000
Ks 0.500000 0.500000 0.500000
Ni -1.5
d 1.000000
illum 2
map_Kd Concrete_08_UV_H_CM_1.bmp

newmtl Material.007
Ns 96.078431
Ka 0.000000 0.000000 0.000000
Kd 0.640000 0.640000 0.640000
Ks 0.500000 0.500000 0.500000
Ni -1.5
d 1.000000
illum 2
map_Kd Alimin.bmp


newmtl Material.008
Ns 96.078431
Ka 0.000000 0.000000 0.000000
Kd 0.640000 0.640000 0.640000
Ks 0.500000 0.500000 0.500000
Ni -1.5
d 1.000000
illum 2
map_Kd tin.bmp

newmtl Material.009
Ns 96.078431
Ka 0.000000 0.000000 0.000000
Kd 0.640000 0.640000 0.640000
Ks 0.500000 0.500000 0.500000
Ni -1.5
d 1.000000
illum 2
map_Kd tin.bmp

newmtl Material.010
Ns 96.078431
Ka 0.000000 0.000000 0.000000
Kd 0.640000 0.640000 0.640000
Ks 0.500000 0.500000 0.500000
Ni -1.5
d 1.000000
illum 2
map_Kd tin.bmp