# 
# Wavefront material file
# Converted by the DEEP Exploration  3.5.9.1158
# Right Hemisphere, LTD
# http://www.righthemisphere.com/
# 

newmtl base2
Ka 0.0980392 0.0980392 0.0980392
Kd 0.698039 0.698039 0.698039
Ks 0 0 0
illum 2
Ns 2
Kd spectral spectra/aloe_leaf.spec
map_Kd SW11stm2.bmp
map_bump SW11stm2_b.bmp

newmtl leaf1
Ka 0.0980392 0.0980392 0.0980392
Kd 0.698039 0.698039 0.698039
Ks 0 0 0
illum 2
Ns 2
Kd spectral spectra/aloe_leaf.spec
map_Kd SW11lef1.bmp
map_d SW11lef1_a.bmp

newmtl leaf2
Ka 0.0980392 0.0980392 0.0980392
Kd 0.698039 0.698039 0.698039
Ks 0 0 0
illum 2
Ns 2
Kd spectral spectra/aloe_leaf.spec
map_Kd SW11lef2.bmp
map_d SW11lef2_a.bmp

newmtl base1
Ka 0.0980392 0.0980392 0.0980392
Kd 0.698039 0.698039 0.698039
Ks 0 0 0
illum 2
Ns 2
Kd spectral spectra/aloe_leaf.spec
map_Kd SW11stm1.bmp
map_bump SW11stm1_b.bmp

newmtl flower3
Ka 0.0980392 0.0980392 0.0980392
Kd 0.698039 0.698039 0.698039
Ks 0 0 0
illum 2
Ns 2
Kd spectral spectra/aloe_flower.spec
map_Kd SW11flo3.bmp
map_d SW11flo3_a.bmp
