# 
# Wavefront material file
# Converted by the DEEP Exploration  3.5.9.1158
# Right Hemisphere, LTD
# http://www.righthemisphere.com/
# 

newmtl base1
Ka 0.0980392 0.0980392 0.0980392
Kd 0.698039 0.698039 0.698039
Ks 0 0 0
illum 2
Ns 2
Kd spectral spectra/agave_leaf.spec
map_Kd SW04stm.bmp
map_bump SW04stm_b.bmp

newmtl base1b
Ka 0.0980392 0.0980392 0.0980392
Kd 0.498039 0.498039 0.498039
Ks 0 0 0
illum 2
Ns 2048
Kd spectral spectra/agave_leaf.spec
map_Kd SW04stm.bmp
map_bump SW04stm_b.bmp

newmtl petal1
Ka 0.0980392 0.0980392 0.0980392
Kd 0.498039 0.498039 0.498039
Ks 0 0 0
illum 2
Ns 2048
Kd spectral spectra/agave_neck.spec
map_Kd SW04pet.bmp

newmtl sta1
Ka 0.0980392 0.0980392 0.0980392
Kd 0.498039 0.498039 0.498039
Ks 0 0 0
illum 2
Ns 2048
Kd spectral spectra/agave_neck.spec
map_Kd SW04sta.bmp
map_bump SW04sta_b.bmp

newmtl petal1b
Ka 0.0980392 0.0980392 0.0980392
Kd 0.698039 0.698039 0.698039
Ks 0 0 0
illum 2
Ns 2
Kd spectral spectra/agave_neck.spec
map_Kd SW04pet.bmp

newmtl sta1b
Ka 0.0980392 0.0980392 0.0980392
Kd 0.698039 0.698039 0.698039
Ks 0 0 0
illum 2
Ns 2
Kd spectral spectra/agave_leaf.spec
map_Kd SW04sta.bmp
map_bump SW04sta_b.bmp
