{
  "Object Labels": "labels.json",

  "Objects": [
    {
      "Mesh": "misc/CornellBox-CeilingLight.obj",
      "Rotate Y to Z": true,
      "Instances": [
        {
          "YawPitchRoll": [ 0.0, 0.0, 0.0 ],
          "Position": [ 0.0, 0.0, 0.0 ],
          "Scale": [ 1.0, 1.0, 1.0 ]
        }
      ]
    },
    {
      "Mesh": "misc/bunny.obj",
      "Rotate Y to Z": true,
      "Instances": [
        {
          "YawPitchRoll": [ 0.0, 0.0, 0.0 ],
          "Position": [ 0.4, -0.25, 0.55 ],
          "Scale": [ 0.4, 0.4, 0.4 ]
        }
      ]
    },
    {
      "Mesh": "misc/cylinder.obj",
      "Rotate Y to Z": true,
      "Instances": [
        {
          "YawPitchRoll": [ 0.0, 0.0, 0.0 ],
          "Position": [ 0.4, -0.0, 0.0 ],
          "Scale": [ 0.2, 0.2, 0.65 ]
        }
      ]
    }
  ]
}
