{
"Object Labels": "labels.json",

  	"Layered Surface":{
		"Mesh": "surfaces/arcscenetin_flipped_meters.obj",
		"Trail": {
			"Trail Width": 2.0,
			"Track Width": 0.6,
			"Wheelbase": 1.25,
      "Path": [
        "waypoints/small_square.vprp"
      ]
		},
		"Layers": "surface_textures/meadow_surfaces.json"
	},

  "Surface Mesh": [
    {
      "Mesh": "surfaces/arcscenetin_flipped_meters.obj",
      "Rotate Y to Z": false,
      "YawPitchRoll": [
        0.0,
        0.0,
        0.0
      ],
      "Position": [
        0.0,
        0.0,
        0.0
      ],
      "Scale": [
        1.0,
        1.0,
        1.0
      ]
    }
  ],

    "Objects": [
	 { 
      	"Mesh": "vegetation/Groundcover/GC08_1.obj",
	"Rotate Y to Z": false,
	"Random": 
	   {
		"Number": 15000,
		"Polygon": [ [-125,-125],[-125,125],[125,125],[125,-125]],
		"Scale": [0.3,0.45]
	   }
      },
	  	 { 
      	"Mesh": "vegetation/Groundcover/GC17_3.obj",
	"Rotate Y to Z": false,
	"Random": 
	   {
		"Number": 5000,
		"Polygon": [ [-125,-125],[-125,125],[125,125],[125,-125]],
		"Scale": [0.15,0.3]
	   }
      },
	  	 { 
      	"Mesh": "vegetation/Groundcover/GC18_1.obj",
	"Rotate Y to Z": false,
	"Random": 
	   {
		"Number": 5000,
		"Polygon": [ [-125,-125],[-125,125],[125,125],[125,-125]],
		"Scale": [0.15,0.3]
	   }
      },
	  	  	 { 
      	"Mesh": "vegetation/Groundcover/GC18_3.obj",
	"Rotate Y to Z": false,
	"Random": 
	   {
		"Number": 5000,
		"Polygon": [[-125,-125],[-125,125],[125,125],[125,-125]],
		"Scale": [0.15,0.3]
	   }
      },
	  	  	 { 
      	"Mesh": "vegetation/USA_Conifers/CL13y.obj",
	"Rotate Y to Z": false,
	"Random": 
	   {
		"Number": 50,
		"Polygon": [[-125,-125],[-125,125],[125,125],[125,-125]],
		"Scale": [0.15,0.25]
	   }
      }
    ]    
}