# 
# Wavefront material file
# Converted by the DEEP Exploration  3.5.9.1158
# Right Hemisphere, LTD
# http://www.righthemisphere.com/
# 

newmtl base1
Ka 0.0980392 0.0980392 0.0980392
Kd 1 1 1
Ks 0 0 0
illum 2
Ns 2048
Kd spectral spectra/agave_leaf.spec
map_Kd SW15stm1.bmp
map_bump SW15stm1_b.bmp

newmtl base3
Ka 0.0980392 0.0980392 0.0980392
Kd 1 1 1
Ks 0 0 0
illum 2
Ns 2048
Kd spectral spectra/agave_leaf.spec
map_Kd SW15stm3.bmp
map_bump SW15stm3_b.bmp

newmtl fruit1
Ka 0.0980392 0.0980392 0.0980392
Kd 1 1 1
Ks 0 0 0
illum 2
Ns 2048
Kd spectral spectra/prickly_pear_fruit.spec
map_Kd SW15frt.bmp
map_bump SW15frt_b.bmp

newmtl base2
Ka 0.0980392 0.0980392 0.0980392
Kd 1 1 1
Ks 0 0 0
illum 2
Ns 2048
Kd spectral spectra/agave_leaf.spec
map_Kd SW15stm2.bmp
map_bump SW15stm2_b.bmp

newmtl thorn1
Ka 0.0980392 0.0980392 0.0980392
Kd 1 1 1
Ks 0 0 0
illum 2
Ns 2048
Kd spectral spectra/prickly_pear_fruit.spec
map_Kd SW15trn1.bmp

newmtl sta1
Ka 0.0980392 0.0980392 0.0980392
Kd 1 1 1
Ks 0 0 0
illum 2
Ns 2048
Kd spectral spectra/agave_neck.spec
map_Kd SW15sta.bmp
map_bump SW15sta.bmp

newmtl base1b
Ka 0.0980392 0.0980392 0.0980392
Kd 0.921569 0.921569 0
Ks 0 0 0
illum 2
Ns 2048
Kd spectral spectra/agave_leaf.spec
map_Kd SW15stm1.bmp
map_bump SW15stm1_b.bmp

newmtl petal1
Ka 0.0980392 0.0980392 0.0980392
Kd 1 1 1
Ks 0 0 0
illum 2
Ns 2048
Kd spectral spectra/prickly_pear_fruit.spec
map_Kd SW15pet1.bmp
map_d SW15pet1_a.bmp

newmtl petal2
Ka 0.0980392 0.0980392 0.0980392
Kd 1 1 1
Ks 0 0 0
illum 2
Ns 2048
Kd spectral spectra/prickly_pear_fruit.spec
map_Kd SW15pet2.bmp
map_d SW15pet2_a.bmp
