#grass_blade_30mm
mtllib grass_blade.mtl

v 0 0.015 0
v 0.00292635 0.014712 0
v 0.00574024 0.0138584 0
v 0.00833355 0.0124725 0
v 0.0106066 0.0106064 0
v 0.0124721 0.00833398 0
v 0.0138582 0.00574047 0
v 0.0147118 0.00292647 0
v 0.015 0 0
v 0.0147118 -0.00292656 0
v 0.0138582 -0.00574056 0
v 0.0124721 -0.00833254 0
v 0.0106066 -0.0106065 0
v 0.00833355 -0.012471 0
v 0.00574024 -0.0138585 0
v 0.00292635 -0.014712 0
v 0 -0.015 0
v -0.00292637 -0.014712 0
v -0.00574026 -0.0138585 0
v -0.00833355 -0.012471 0
v -0.0106066 -0.0106065 0
v -0.0124721 -0.00833254 0
v -0.0138582 -0.00574056 0
v -0.0147118 -0.00292656 0
v -0.015 0 0
v -0.0147118 0.00292647 0
v -0.0138582 0.00574047 0
v -0.0124721 0.00833398 0
v -0.0106066 0.0106064 0
v -0.00833355 0.0124725 0
v -0.00574023 0.0138584 0
v -0.00292633 0.014712 0
v 3e-08 0.015 1
v 0.00292638 0.014712 1
v 0.00574028 0.0138584 1
v 0.00833355 0.0124725 1
v 0.0106067 0.0106064 1
v 0.0124721 0.00833398 1
v 0.0138582 0.00574047 1
v 0.0147118 0.00292647 1
v 0.015 0 1
v 0.0147118 -0.00292656 1
v 0.0138582 -0.00574056 1
v 0.0124721 -0.00833254 1
v 0.0106066 -0.0106065 1
v 0.00833355 -0.012471 1
v 0.00574026 -0.0138585 1
v 0.00292637 -0.014712 1
v 1.5e-08 -0.015 1
v -0.00292633 -0.014712 1
v -0.00574023 -0.0138585 1
v -0.00833355 -0.012471 1
v -0.0106066 -0.0106065 1
v -0.0124721 -0.00833254 1
v -0.0138582 -0.00574056 1
v -0.0147118 -0.00292656 1
v -0.015 0 1
v -0.0147118 0.00292647 1
v -0.0138582 0.00574047 1
v -0.0124721 0.00833398 1
v -0.0106067 0.0106064 1
v -0.00833363 0.0124725 1
v -0.00574033 0.0138584 1
v -0.00292646 0.014712 1
vn 0 0 -0.999969
vn 0.195074 0 -0.980773
vn 0.382672 0 -0.923856
vn 0.555559 0 -0.831446
vn 0.707083 0 -0.707083
vn 0.831446 0 -0.555559
vn 0.923856 0 -0.382672
vn 0.980773 0 -0.195074
vn 0.999969 0 0
vn 0.980773 0 0.195074
vn 0.923856 0 0.382672
vn 0.831446 0 0.555559
vn 0.707083 0 0.707083
vn 0.555559 0 0.831446
vn 0.382672 0 0.923856
vn 0.195074 0 0.980773
vn 0 0 1
vn -0.195074 0 0.980773
vn -0.382672 0 0.923856
vn -0.555559 0 0.831446
vn -0.707083 0 0.707083
vn -0.831446 0 0.555559
vn -0.923856 0 0.382672
vn -0.980773 0 0.195074
vn -1 0 0
vn -0.980773 0 -0.195074
vn -0.923856 0 -0.382672
vn -0.831446 0 -0.555559
vn -0.707083 0 -0.707083
vn -0.555559 0 -0.831446
vn -0.382672 0 -0.923856
vn -0.195074 0 -0.980773
vt 2.24067 -4.3e-05
vt 2.24067 0.999957
vt 2.12463 0.999957
vt 2.12463 -4.3e-05
vt 2.00859 0.999957
vt 2.00859 -4.3e-05
vt 1.89254 0.999957
vt 1.89254 -4.3e-05
vt 1.7765 0.999957
vt 1.7765 -4.3e-05
vt 1.66046 0.999957
vt 1.66046 -4.3e-05
vt 1.54442 0.999957
vt 1.54442 -4.3e-05
vt 1.42837 0.999957
vt 1.42838 -4.3e-05
vt 1.31233 0.999957
vt 1.31233 -4.3e-05
vt 1.19629 0.999958
vt 1.19629 -4.3e-05
vt 1.08025 0.999958
vt 1.08025 -4.3e-05
vt 0.964206 0.999958
vt 0.964206 -4.3e-05
vt 0.848163 0.999958
vt 0.848163 -4.3e-05
vt 0.732121 0.999958
vt 0.732121 -4.3e-05
vt 0.616079 0.999958
vt 0.616079 -4.3e-05
vt 0.500037 0.999958
vt 0.500036 -4.3e-05
vt 0.383995 0.999958
vt 0.383994 -4.3e-05
vt 0.267953 0.999958
vt 0.267952 -4.3e-05
vt 0.151911 0.999958
vt 0.151909 -4.3e-05
vt 0.035868 0.999958
vt 0.035867 -4.3e-05
vt -0.080174 0.999958
vt -0.080175 -4.3e-05
vt -0.196216 0.999958
vt -0.196218 -4.3e-05
vt -0.312258 0.999958
vt -0.31226 -4.3e-05
vt -0.4283 0.999958
vt -0.428302 -4.3e-05
vt -0.544343 0.999958
vt -0.544345 -4.3e-05
vt -0.660385 0.999958
vt -0.660388 -4.3e-05
vt -0.776427 0.999957
vt -0.77643 -4.3e-05
vt -0.892469 0.999957
vt -0.892473 -4.3e-05
vt -1.00851 0.999957
vt -1.00852 -4.3e-05
vt -1.12455 0.999957
vt -1.12456 -4.3e-05
vt -1.24059 0.999957
vt -1.2406 -4.3e-05
vt -1.35664 0.999957
vt -1.35664 -4.3e-05
vt 2.35671 -4.3e-05
vt 2.35672 0.999957
usemtl grass_blade
f 1/1/1 33/2/1 34/3/2
f 1/1/1 34/3/2 2/4/2
f 2/4/2 34/3/2 35/5/3
f 2/4/2 35/5/3 3/6/3
f 3/6/3 35/5/3 36/7/4
f 3/6/3 36/7/4 4/8/4
f 4/8/4 36/7/4 37/9/5
f 4/8/4 37/9/5 5/10/5
f 5/10/5 37/9/5 38/11/6
f 5/10/5 38/11/6 6/12/6
f 6/12/6 38/11/6 39/13/7
f 6/12/6 39/13/7 7/14/7
f 7/14/7 39/13/7 40/15/8
f 7/14/7 40/15/8 8/16/8
f 8/16/8 40/15/8 41/17/9
f 8/16/8 41/17/9 9/18/9
f 9/18/9 41/17/9 42/19/10
f 9/18/9 42/19/10 10/20/10
f 10/20/10 42/19/10 43/21/11
f 10/20/10 43/21/11 11/22/11
f 11/22/11 43/21/11 44/23/12
f 11/22/11 44/23/12 12/24/12
f 12/24/12 44/23/12 45/25/13
f 12/24/12 45/25/13 13/26/13
f 13/26/13 45/25/13 46/27/14
f 13/26/13 46/27/14 14/28/14
f 14/28/14 46/27/14 47/29/15
f 14/28/14 47/29/15 15/30/15
f 15/30/15 47/29/15 48/31/16
f 15/30/15 48/31/16 16/32/16
f 16/32/16 48/31/16 49/33/17
f 16/32/16 49/33/17 17/34/17
f 17/34/17 49/33/17 50/35/18
f 17/34/17 50/35/18 18/36/18
f 18/36/18 50/35/18 51/37/19
f 18/36/18 51/37/19 19/38/19
f 19/38/19 51/37/19 52/39/20
f 19/38/19 52/39/20 20/40/20
f 20/40/20 52/39/20 53/41/21
f 20/40/20 53/41/21 21/42/21
f 21/42/21 53/41/21 54/43/22
f 21/42/21 54/43/22 22/44/22
f 22/44/22 54/43/22 55/45/23
f 22/44/22 55/45/23 23/46/23
f 23/46/23 55/45/23 56/47/24
f 23/46/23 56/47/24 24/48/24
f 24/48/24 56/47/24 57/49/25
f 24/48/24 57/49/25 25/50/25
f 25/50/25 57/49/25 58/51/26
f 25/50/25 58/51/26 26/52/26
f 26/52/26 58/51/26 59/53/27
f 26/52/26 59/53/27 27/54/27
f 27/54/27 59/53/27 60/55/28
f 27/54/27 60/55/28 28/56/28
f 28/56/28 60/55/28 61/57/29
f 28/56/28 61/57/29 29/58/29
f 29/58/29 61/57/29 62/59/30
f 29/58/29 62/59/30 30/60/30
f 30/60/30 62/59/30 63/61/31
f 30/60/30 63/61/31 31/62/31
f 31/62/31 63/61/31 64/63/32
f 31/62/31 64/63/32 32/64/32
f 33/2/1 1/1/1 32/65/32
f 33/2/1 32/65/32 64/66/32
