{
  "Object Labels": "labels.json",


  "Surface Mesh": [
    {
      "Mesh": "surfaces/proving_ground_vignette/video_scene_surface.obj",
      "Rotate Y to Z": true,
      "YawPitchRoll": [ 0.0, 0.0, 0.0 ],
      "Position": [ 0.0, 0.0, 0.0 ],
      "Scale": [ 1.0, 1.0, 1.0 ]
    }
  ],

  "Objects": [
    {
      "Mesh": "surfaces/proving_ground_vignette/video_scene.obj",
      "Rotate Y to Z": true,
      "Instances": [
        {
          "YawPitchRoll": [ 0, 0, 0 ],
          "Position": [ 0.0, 0.0, 0.0 ],
          "Scale": [ 1.0, 1.0, 1.0 ]
        }
      ]
    }
  ]
}
