{
  "Object Labels": "labels.json",
  
  	"Layered Surface":{
		"Mesh": "surfaces/surface.obj",
		"Trail": {
			"Trail Width": 2.0,
			"Track Width": 0.6,
			"Wheelbase": 1.25,
			"Path": "waypoints/x_axis_points.vprp"
		},
		"Layers": "surface_textures/road_surfaces.json"
	},
  
  "Surface Mesh": [
    {
      "Mesh": "surfaces/surface.obj",
      "Rotate Y to Z": false,
      "YawPitchRoll": [
        0.0,
        0.0,
        0.0
      ],
      "Position": [
        0.0,
        0.0,
        0.0
      ],
      "Scale": [
        1.0,
        1.0,
        1.0
      ]
    }
  ],

    "Objects": [
      {
        "Mesh": "urban/roadblock/RoadBlockade_02.obj",
	"Rotate Y to Z": true,
	"Instances":[
	{"YawPitchRoll":[0,90,0],
	 "Position": [0.0,0,0.0],
	 "Scale": [0.75,0.75,0.75]
	}
	]
      }
    ]    
}
