{

  "Chassis": {
    "Sprung Mass": 2086.52,
    "CG Offset": 0.3,
    "Dimensions": [ 3.3, 1.39, 1.46 ]
  },

  "Powertrain": {
    "Final Drive Ratio": 3.3,
    "Max Engine Torque": 583.0,
    "Max Engine Rpm": 4500.0,
    "Max Braking Torque": 3200.0,
    "Idle Rpm": 1000.0
  },

  "Axles": [
    {
      "Longitudinal Offset": 1.688965,
      "Track Width": 1.80,
      "Spring Constant": 82372.5,
      "Damping Constant": 13110.0,
      "Spring Length": 0.339,
      "Steered": true,
      "Powered": true,
      "Max Steer Angle": 30.23,
      "Unsprung Mass": 62.0,
      "Tire": {
        "Spring Constant": 322369.0,
        "Damping Constant": 51870.0,
        "Radius": 0.39243,
        "Width": 0.2413,
        "Section Height": 0.17526,
        "High Slip Crossover Angle": 5.0,
        "Viscous Friction Coefficient": 0.05
      }
    },
    {
      "Longitudinal Offset": -1.688965,
      "Track Width": 1.80,
      "Spring Constant": 82372.5,
      "Damping Constant": 13110.0,
      "Spring Length": 0.382,
      "Steered": false,
      "Powered": true,
      "Unsprung Mass": 62.0,
      "Tire": {
        "Spring Constant": 322369.0,
        "Damping Constant": 51870.0,
        "Radius": 0.39243,
        "Width": 0.2413,
        "Section Height": 0.17526,
        "High Slip Crossover Angle": 5.0,
        "Viscous Friction Coefficient": 0.05
      }
    }
  ],



  "Mesh": {
    "File": "vehicles/hmmwv/hmmwv_body_rotated_scaled_shifted.obj",
    "Rotate Y to Z": false,
    "Rotate X to Y": false,
    "Rotate Y to X": false,
    "Offset": [ 0.0, 0.0, 0.0 ],
    "Scale": [ 1.0, 1.0, 1.0 ]
  },

  "Tire Mesh": {
    "File": "vehicles/hmmwv/hmmwv_wheel_rotated_scaled.obj",
    "Rotate Y to Z": false,
    "Rotate X to Y": false,
    "Rotate Y to X": false,
    "Offset": [ 0.0, 0.0, 0.0 ],
    "Scale": [ 1.0, 1.0, 1.0 ]
  },

  "Initial Pose": {
    "Position": [ 0.0, 0.0, 0.0 ],
    "Orientation": [ 1.0, 0.0, 0.0, 0.0 ]
  }
}
