{

  "Scene": {
    "Input File": "scenes/city_surface_only.json",
    "Origin": [ 32.3526, 90.8779, 73.152 ],
    "Time Zone": 6
  },

  "Poses": {
    "Pose File": "waypoints/euro_ncap_path.vprp",
    "Pose Type": "anvel"
  },

  "Sensors": [
    {
      "Type": "camera",
      "Model": "XCD-V60",
      "Offset": [ -15.0, 0.0, 1.5 ],
      "Orientation": [ 1.0, 0.0, 0.0, 0.0 ],
      "Repitition Rate (Hz)": 30.0,
      "Name": "camera"
    }
  ],

  "Vehicle": {
    "Input File": "vehicles/rp3d_vehicles/hmmwv_rp3d.json",
    "Dusty": false
  },

  "Controller": {
    "Steering Coefficient": 0.7,
    "Max Steering Angle": 0.52,
    "Max Speed": 5.0,
    "Wheelbase": 3.4
  },

  "Environment": {
    "Month": 6,
    "Day": 5,
    "Year": 2004,
    "Hour": 14,
    "Minute": 0,
    "Second": 0,
    "Turbidity": 3.0,
    "Rain Rate": 0.0,
    "Fog": 1.0,
    "Cloud Cover": 100.0,
    "Local Albedo": 0.25
  }
}
