# 3ds Max Wavefront OBJ Exporter v0.97b - (c)2007 guruware
# File Created: 17.07.2019 11:23:49

newmtl Standard_22
	Ns 26.0000
	Ni -1.5
	d 1.0000
	Tr 0.0000
	Tf 1.0000 1.0000 1.0000 
	illum 2
	Ka 0.0667 0.1451 0.3882
	Kd 0.0667 0.1451 0.3882
	Ks 0.2610 0.2610 0.2610
	Ke 0.0000 0.0000 0.0000
