# 
# Wavefront material file
# Converted by the DEEP Exploration  3.5.9.1158
# Right Hemisphere, LTD
# http://www.righthemisphere.com/
# 

newmtl Stalk2
Ka 0.0980392 0.0980392 0.0980392
Kd 0.698039 0.698039 0.698039
Ks 0 0 0
illum 2
Ns 2
Kd spectral spectra/black_raspberry_leaf.spec
map_Kd GC20stm2.bmp
map_bump GC20stm2_b.bmp

newmtl Leaf3
Ka 0.0980392 0.0980392 0.0980392
Kd 0.698039 0.698039 0.698039
Ks 0 0 0
illum 2
Ns 2
Kd spectral spectra/black_raspberry_leaf.spec
map_Kd GC20lef3.bmp
map_d GC20lef3_a.bmp

newmtl Leaf6
Ka 0.0980392 0.0980392 0.0980392
Kd 0.698039 0.698039 0.698039
Ks 0 0 0
illum 2
Ns 2
Kd spectral spectra/black_raspberry_leaf.spec
map_Kd GC20lef6.bmp
map_d GC20lef6_a.bmp

newmtl Center
Ka 0.0980392 0.0980392 0.0980392
Kd 0.698039 0.698039 0.698039
Ks 0 0 0
illum 2
Ns 2
Kd spectral spectra/black_raspberry_leaf.spec
map_Kd GC20cnt.bmp
map_bump GC20cnt_b.bmp

newmtl Petal
Ka 0.0980392 0.0980392 0.0980392
Kd 0.698039 0.698039 0.698039
Ks 0 0 0
illum 2
Ns 2
Kd spectral spectra/purple_petunia.spec
map_Kd GC20pet.bmp
map_d GC20pet_a.bmp
