# 
# Wavefront material file
# Converted by the DEEP Exploration  3.5.9.1158
# Right Hemisphere, LTD
# http://www.righthemisphere.com/
# 

newmtl Bark
Ka 0.313726 0.313726 0.313726
Kd 1 1 1
Ks 0 0 0
illum 2
Ns 2048
map_Kd EA13brk.bmp
map_bump EA13brk_b.bmp

newmtl Leaf
Ka 0.313726 0.313726 0.313726
Kd 1 1 1
Ks 0 0 0
illum 2
Ns 2048
map_Kd EA13lef.bmp
map_d EA13lef_a.bmp

newmtl Barkb
Ka 0.392157 0.392157 0.392157
Kd 1 1 1
Ks 0 0 0
illum 2
Ns 2048
map_Kd EA13brk.bmp
map_bump EA13brk_b.bmp
