# 
# Wavefront material file
# Converted by the DEEP Exploration  3.5.9.1158
# Right Hemisphere, LTD
# http://www.righthemisphere.com/
# 

newmtl Bark
Ka 0.392157 0.392157 0.392157
Kd 1 1 1
Ks 0 0 0
illum 2
Ns 2048
Kd spectral spectra/lodgepole_pine_bark.spec
map_Kd EA12brk.bmp
map_bump EA12brk_b.bmp

newmtl Needle
Ka 0.34902 0.392157 0
Kd 1 1 1
Ks 0 0 0
illum 2
Ns 2048
Kd spectral spectra/lodgepole_pine_needles.spec
map_Kd EA12ned.bmp
map_d EA12ned_a.bmp
