# Blender MTL File: 'warthog.blend'
# Material Count: 8

newmtl None
Ns 500
Ka 0.8 0.8 0.8
Kd 0.8 0.8 0.8
Ks 0.8 0.8 0.8
d 1
illum 2

newmtl chassis_mat
Ns 225.000000
Ka 0.800000 0.800000 0.800000
Kd 0.150000 0.150000 0.150000
Ks 0.500000 0.500000 0.500000
Ke 0.0 0.0 0.0
Ni 1.450000
d 1.000000
illum 3

newmtl diif_unit_mat
Ns 323.999994
Ka 0.500000 0.500000 0.500000
Kd 0.950000 0.816001 0.082000
Ks 0.500000 0.500000 0.500000
Ke 0.0 0.0 0.0
Ni 1.450000
d 1.000000
illum 3

newmtl estop_mat
Ns 225.000000
Ka 0.500000 0.500000 0.500000
Kd 0.900000 0.000000 0.000000
Ks 0.500000 0.500000 0.500000
Ke 0.0 0.0 0.0
Ni 1.450000
d 1.000000
illum 3

newmtl light_mat
Ns 225.000000
Ka 1.000000 1.000000 1.000000
Kd 0.900000 0.900000 0.900000
Ks 0.500000 0.500000 0.500000
Ke 0.0 0.0 0.0
Ni 1.450000
d 1.000000
illum 2

newmtl red_light_mat
Ns 225.000000
Ka 1.000000 1.000000 1.000000
Kd 0.900000 0.000000 0.000000
Ks 0.500000 0.500000 0.500000
Ke 0.0 0.0 0.0
Ni 1.450000
d 1.000000
illum 2

newmtl rocker_mat
Ns 225.000000
Ka 0.800000 0.800000 0.800000
Kd 0.150000 0.150000 0.150000
Ks 0.500000 0.500000 0.500000
Ke 0.0 0.0 0.0
Ni 1.450000
d 1.000000
illum 3

newmtl wheel_mat
Ns 110.250015
Ka 1.000000 1.000000 1.000000
Kd 0.200000 0.200000 0.200000
Ks 0.300000 0.300000 0.300000
Ke 0.0 0.0 0.0
Ni 1.450000
d 1.000000
illum 2
