#
# Wavefront material file
# Converted by Meshlab Group
#

newmtl material_0
Ka 0.200000 0.200000 0.200000
Kd 0.584314 0.584314 0.584314
Ks 1.000000 1.000000 1.000000
Tr 1.000000
illum 2
Kd spectral spectra/olive_green_paint.spec
Ns 1.000000
Ni -1.5

newmtl material_1
Ka 0.200000 0.200000 0.200000
Kd 0.584314 0.584314 0.584314
Ks 1.000000 1.000000 1.000000
Tr 1.000000
illum 2
Ns 1.000000
Ni -1.5
Kd spectral spectra/olive_green_paint.spec
map_Kd HUMVEE.bmp

newmtl material_2
Ka 0.200000 0.200000 0.200000
Kd 0.584314 0.584314 0.584314
Ks 1.000000 1.000000 1.000000
Tr 1.000000
illum 2
Ns 1.000000
Ni -1.5
Kd spectral spectra/olive_green_paint.spec
map_Kd ITERIER.bmp

newmtl material_3
Ka 0.200000 0.200000 0.200000
Kd 0.584314 0.584314 0.584314
Ks 1.000000 1.000000 1.000000
Tr 1.000000
illum 2
Ns 1.000000
Ni -1.5
Kd spectral spectra/weathered_black_tar_paper.spec
map_Kd WHEELS.bmp

