﻿account,item_name,debt_credit,group,sort_group,category,project_name,id
1010,Деньги,,Текущие активы,1,Активы,Energy Trade,1
1030,Деньги,,Текущие активы,1,Активы,Energy Trade,2
1060,Деньги,,Текущие активы,1,Активы,Energy Trade,3
1210,Дебиторская задолженность,debt,Текущие активы,1,Активы,Energy Trade,4
1272,Дебиторская задолженность,debt,Текущие активы,1,Активы,Energy Trade,5
1274,Дебиторская задолженность,debt,Текущие активы,1,Активы,Energy Trade,6
1251,Подотчет,,Текущие активы,1,Активы,Energy Trade,7
1310,Складские запасы,,Текущие активы,1,Активы,Energy Trade,8
1330,Складские запасы,,Текущие активы,1,Активы,Energy Trade,9
1710,Авансы выданные,,Текущие активы,1,Активы,Energy Trade,10
2410,Основные средства,,Внеоборотные активы,2,Активы,Energy Trade,11
1410,Налоги и отчисления,,Текущие обязательства,3,Пассивы,Energy Trade,12
1421,Налоги и отчисления,,Текущие обязательства,3,Пассивы,Energy Trade,13
1422,Налоги и отчисления,,Текущие обязательства,3,Пассивы,Energy Trade,14
3110,Налоги и отчисления,,Текущие обязательства,3,Пассивы,Energy Trade,15
3120,Налоги и отчисления,,Текущие обязательства,3,Пассивы,Energy Trade,16
3130,Налоги и отчисления,,Текущие обязательства,3,Пассивы,Energy Trade,17
3150,Налоги и отчисления,,Текущие обязательства,3,Пассивы,Energy Trade,18
3170,Налоги и отчисления,,Текущие обязательства,3,Пассивы,Energy Trade,19
3190,Налоги и отчисления,,Текущие обязательства,3,Пассивы,Energy Trade,20
3211,Налоги и отчисления,,Текущие обязательства,3,Пассивы,Energy Trade,21
3212,Налоги и отчисления,,Текущие обязательства,3,Пассивы,Energy Trade,22
3213,Налоги и отчисления,,Текущие обязательства,3,Пассивы,Energy Trade,23
3220,Налоги и отчисления,,Текущие обязательства,3,Пассивы,Energy Trade,24
3230,Налоги и отчисления,,Текущие обязательства,3,Пассивы,Energy Trade,25
3350,Зар. плата,,Текущие обязательства,3,Пассивы,Energy Trade,26
3310,Кредиторская задолженность,credit,Текущие обязательства,3,Пассивы,Energy Trade,27
3387,Кредиторская задолженность,credit,Текущие обязательства,3,Пассивы,Energy Trade,28
3510,Авансы полученные,,Текущие обязательства,3,Пассивы,Energy Trade,29
3050,Кредиты,,Текущие обязательства,3,Пассивы,Energy Trade,30
3080,Кредиты,,Текущие обязательства,3,Пассивы,Energy Trade,31
3040,Дивиденды,,Собственный капитал,4,Пассивы,Energy Trade,32
5030,Уставный капитал,,Собственный капитал,4,Пассивы,Energy Trade,33
5610,Нераспределенная прибыль,,Собственный капитал,4,Пассивы,Energy Trade,34
