<svg width="182" height="51" viewBox="0 0 182 51" fill="none" xmlns="http://www.w3.org/2000/svg">
<path d="M5.84481 51L73 42.1997L67.1552 0L0 8.80025L5.84481 51Z" fill="#81007F"/>
<path d="M44.48 14.6C46.5067 14.6 48.2667 14.9413 49.76 15.624C51.2533 16.2853 52.4053 17.2453 53.216 18.504C54.0267 19.7413 54.432 21.2027 54.432 22.888C54.432 24.5733 54.0267 26.0347 53.216 27.272C52.4053 28.5093 51.2533 29.4693 49.76 30.152C48.2667 30.8133 46.5067 31.144 44.48 31.144H40.576V37H34.24V14.6H44.48ZM44.096 26.152C45.3973 26.152 46.3787 25.8747 47.04 25.32C47.7013 24.744 48.032 23.9333 48.032 22.888C48.032 21.8427 47.7013 21.032 47.04 20.456C46.3787 19.88 45.3973 19.592 44.096 19.592H40.576V26.152H44.096ZM65.906 37.288C64.05 37.288 62.3753 36.904 60.882 36.136C59.3887 35.368 58.2153 34.3013 57.362 32.936C56.53 31.5707 56.114 30.024 56.114 28.296C56.114 26.5893 56.53 25.0533 57.362 23.688C58.2153 22.3227 59.378 21.2667 60.85 20.52C62.3433 19.752 64.0287 19.368 65.906 19.368C67.7833 19.368 69.4687 19.752 70.962 20.52C72.4553 21.2667 73.618 22.3227 74.45 23.688C75.282 25.032 75.698 26.568 75.698 28.296C75.698 30.024 75.282 31.5707 74.45 32.936C73.618 34.3013 72.4553 35.368 70.962 36.136C69.4687 36.904 67.7833 37.288 65.906 37.288ZM65.906 32.456C66.9727 32.456 67.8473 32.0933 68.53 31.368C69.2127 30.6213 69.554 29.5973 69.554 28.296C69.554 27.016 69.2127 26.0133 68.53 25.288C67.8473 24.5627 66.9727 24.2 65.906 24.2C64.8393 24.2 63.9647 24.5627 63.282 25.288C62.5993 26.0133 62.258 27.016 62.258 28.296C62.258 29.5973 62.5993 30.6213 63.282 31.368C63.9647 32.0933 64.8393 32.456 65.906 32.456ZM84.3065 21.736C84.9252 20.9467 85.7252 20.36 86.7065 19.976C87.7092 19.5707 88.8505 19.368 90.1305 19.368V24.84C89.5758 24.776 89.1172 24.744 88.7545 24.744C87.4532 24.744 86.4292 25.096 85.6825 25.8C84.9572 26.504 84.5945 27.5813 84.5945 29.032V37H78.5145V19.656H84.3065V21.736ZM105.139 36.296C104.627 36.616 103.997 36.8613 103.251 37.032C102.525 37.2027 101.747 37.288 100.915 37.288C98.6534 37.288 96.9148 36.7333 95.6988 35.624C94.4828 34.5147 93.8748 32.8613 93.8748 30.664V24.84H91.3468V20.296H93.8748V15.784H99.9548V20.296H103.923V24.84H99.9548V30.6C99.9548 31.2187 100.115 31.7093 100.435 32.072C100.776 32.4133 101.224 32.584 101.779 32.584C102.483 32.584 103.101 32.4027 103.635 32.04L105.139 36.296ZM114.107 20.296H118.235V24.84H114.267V37H108.187V24.84H105.659V20.296H108.187V19.848C108.187 17.736 108.817 16.0613 110.075 14.824C111.355 13.5867 113.137 12.968 115.419 12.968C116.187 12.968 116.934 13.0427 117.659 13.192C118.385 13.3413 118.982 13.5653 119.451 13.864L117.947 18.152C117.35 17.8107 116.742 17.64 116.123 17.64C115.483 17.64 114.982 17.832 114.619 18.216C114.278 18.6 114.107 19.1653 114.107 19.912V20.296ZM129 37.288C127.144 37.288 125.469 36.904 123.976 36.136C122.482 35.368 121.309 34.3013 120.456 32.936C119.624 31.5707 119.208 30.024 119.208 28.296C119.208 26.5893 119.624 25.0533 120.456 23.688C121.309 22.3227 122.472 21.2667 123.944 20.52C125.437 19.752 127.122 19.368 129 19.368C130.877 19.368 132.562 19.752 134.056 20.52C135.549 21.2667 136.712 22.3227 137.544 23.688C138.376 25.032 138.792 26.568 138.792 28.296C138.792 30.024 138.376 31.5707 137.544 32.936C136.712 34.3013 135.549 35.368 134.056 36.136C132.562 36.904 130.877 37.288 129 37.288ZM129 32.456C130.066 32.456 130.941 32.0933 131.624 31.368C132.306 30.6213 132.648 29.5973 132.648 28.296C132.648 27.016 132.306 26.0133 131.624 25.288C130.941 24.5627 130.066 24.2 129 24.2C127.933 24.2 127.058 24.5627 126.376 25.288C125.693 26.0133 125.352 27.016 125.352 28.296C125.352 29.5973 125.693 30.6213 126.376 31.368C127.058 32.0933 127.933 32.456 129 32.456ZM141.608 13.256H147.688V37H141.608V13.256ZM151.64 19.656H157.72V37H151.64V19.656ZM154.68 17.736C153.57 17.736 152.674 17.4267 151.992 16.808C151.309 16.1893 150.968 15.4213 150.968 14.504C150.968 13.5867 151.309 12.8187 151.992 12.2C152.674 11.5813 153.57 11.272 154.68 11.272C155.789 11.272 156.685 11.5707 157.368 12.168C158.05 12.744 158.392 13.4907 158.392 14.408C158.392 15.368 158.05 16.168 157.368 16.808C156.685 17.4267 155.789 17.736 154.68 17.736ZM170.375 37.288C168.519 37.288 166.844 36.904 165.351 36.136C163.857 35.368 162.684 34.3013 161.831 32.936C160.999 31.5707 160.583 30.024 160.583 28.296C160.583 26.5893 160.999 25.0533 161.831 23.688C162.684 22.3227 163.847 21.2667 165.319 20.52C166.812 19.752 168.497 19.368 170.375 19.368C172.252 19.368 173.937 19.752 175.431 20.52C176.924 21.2667 178.087 22.3227 178.919 23.688C179.751 25.032 180.167 26.568 180.167 28.296C180.167 30.024 179.751 31.5707 178.919 32.936C178.087 34.3013 176.924 35.368 175.431 36.136C173.937 36.904 172.252 37.288 170.375 37.288ZM170.375 32.456C171.441 32.456 172.316 32.0933 172.999 31.368C173.681 30.6213 174.023 29.5973 174.023 28.296C174.023 27.016 173.681 26.0133 172.999 25.288C172.316 24.5627 171.441 24.2 170.375 24.2C169.308 24.2 168.433 24.5627 167.751 25.288C167.068 26.0133 166.727 27.016 166.727 28.296C166.727 29.5973 167.068 30.6213 167.751 31.368C168.433 32.0933 169.308 32.456 170.375 32.456Z" fill="white"/>
</svg>
