<svg width="175" height="80" viewBox="0 0 175 80" fill="none" xmlns="http://www.w3.org/2000/svg">
<path d="M80.5546 52.3425C80.6862 52.4736 80.8077 52.6125 80.9236 52.7581C81.0384 52.9059 81.1298 53.0603 81.1934 53.2237C81.2915 53.4525 81.3729 53.6803 81.4386 53.9092C81.4877 54.1237 81.5122 54.3437 81.5122 54.5704C81.5122 54.9948 81.4297 55.4026 81.2658 55.7948C81.102 56.1882 80.8634 56.5382 80.5535 56.8471C79.4387 57.9582 77.7543 59.6371 75.4935 61.8905C74.838 62.5439 74.0844 63.0494 73.2338 63.4083C72.4156 63.7672 71.5639 63.965 70.6798 63.9961H70.6308C69.6487 64.0295 68.6978 63.8661 67.7814 63.5061C66.8818 63.1628 66.0624 62.625 65.3255 61.8905C65.3088 61.8739 65.2843 61.8494 65.252 61.8172C64.6299 61.1972 63.7046 60.2749 62.4761 59.0505C62.4594 59.0338 62.4349 59.0094 62.4026 58.9771C61.6657 58.2427 61.1172 57.4182 60.7571 56.5048C60.3971 55.5915 60.241 54.6537 60.29 53.6892C60.3235 52.8081 60.503 51.9436 60.8307 51.0947C61.1919 50.2458 61.698 49.4958 62.3535 48.8424C62.5988 48.598 62.951 48.2469 63.4092 47.7902C63.6712 47.5291 64.0725 47.1291 64.6132 46.5913C65.2029 46.0035 65.8751 45.5479 66.6276 45.2201C67.3645 44.8779 68.1259 44.6568 68.9118 44.559C69.0099 44.559 69.1158 44.5512 69.2306 44.5346C69.3287 44.5346 69.4268 44.5346 69.5249 44.5346C70.458 44.4857 71.3911 44.6323 72.3253 44.9757C73.2416 45.3357 74.061 45.8735 74.7811 46.5913C74.8146 46.6246 74.8469 46.6568 74.8792 46.6891C75.0754 46.8846 75.3709 47.1791 75.7633 47.5702C76.2883 48.0935 76.5492 48.7147 76.5492 49.4302C76.5659 50.1658 76.3117 50.7936 75.7878 51.3147C75.673 51.4292 75.518 51.5836 75.3207 51.7803L75.2962 51.8047C73.6753 53.4203 71.2439 55.8437 68.0021 59.0749C68.0189 59.0916 68.0434 59.116 68.0757 59.1482C68.7145 59.7849 69.4915 60.1027 70.409 60.1027C71.3264 60.1027 72.1034 59.7849 72.7422 59.1482C73.3642 58.5282 74.2895 57.606 75.518 56.3815C76.4176 55.4848 77.7777 54.1292 79.5948 52.3181C79.7252 52.1881 79.8802 52.1314 80.0619 52.147C80.2603 52.147 80.4242 52.2125 80.5546 52.3425ZM65.1806 56.3082C66.719 54.7748 69.0121 52.4559 72.0577 49.3558C71.4189 48.7191 70.6408 48.4024 69.7245 48.4013C68.8081 48.4024 68.03 48.7202 67.3912 49.3558C67.146 49.6013 66.7848 49.9602 66.311 50.4325C66.049 50.6936 65.6555 51.0858 65.1316 51.6081C64.4928 52.2447 64.174 53.0214 64.174 53.9337C64.174 54.8481 64.4928 55.6226 65.1316 56.2593C65.1483 56.276 65.165 56.2926 65.1806 56.3082Z" fill="white"/>
<path d="M104.954 16.6266C105.616 17.2866 106.6 18.2677 107.907 19.5711C108.652 20.3134 109.189 21.1456 109.52 22.0712C109.868 23.0101 110.033 23.969 110.016 24.9412C109.984 25.8313 109.793 26.698 109.445 27.5391C109.081 28.3969 108.56 29.1636 107.881 29.8403C107.633 30.088 107.277 30.4425 106.813 30.9047C106.417 31.3003 105.828 31.887 105.052 32.6603C104.82 32.8914 104.463 33.247 103.984 33.7248C103.305 34.4015 102.536 34.9204 101.675 35.2837C100.815 35.6471 99.9474 35.8371 99.069 35.8526C98.0757 35.886 97.1159 35.7204 96.1895 35.3582C95.2642 35.0282 94.4259 34.4926 93.6812 33.7503C93.019 33.0903 92.0347 32.1092 90.7282 30.8069C90.0002 30.0814 89.4618 29.248 89.1151 28.3069C88.7516 27.3835 88.5945 26.4346 88.6435 25.4613C88.6602 24.5868 88.8431 23.7145 89.1909 22.839C89.5387 21.9978 90.0515 21.2389 90.7304 20.5622C90.9623 20.3311 91.3179 19.9778 91.7984 19.4978C92.1952 19.1022 92.7838 18.5155 93.5608 17.7422C93.7916 17.5111 94.1472 17.1577 94.6288 16.6777C95.3077 16.001 96.0769 15.4821 96.9375 15.1188C97.7981 14.7888 98.6743 14.6088 99.5684 14.5732C100.546 14.5243 101.496 14.6799 102.423 15.0432C103.365 15.3888 104.21 15.9166 104.954 16.6266ZM102.15 19.4211C101.505 18.7778 100.719 18.4555 99.7914 18.4555C98.8661 18.4555 98.0791 18.7767 97.4325 19.4211C97.1839 19.6689 96.8283 20.0233 96.3645 20.4856C95.9677 20.8811 95.379 21.4678 94.6032 22.2412C94.3713 22.4723 94.0145 22.8279 93.5352 23.3056C92.8897 23.949 92.5676 24.7323 92.5676 25.6568C92.5687 26.5802 92.8897 27.3635 93.5352 28.008C94.1974 28.668 95.1895 29.6569 96.5139 30.9769C97.1594 31.6203 97.9453 31.9414 98.8728 31.9414C99.7992 31.9425 100.585 31.6203 101.232 30.9769C101.464 30.7458 101.818 30.3925 102.3 29.9125C102.696 29.5169 103.283 28.9325 104.061 28.1569C104.293 27.9258 104.648 27.5713 105.129 27.0924C105.774 26.4491 106.097 25.6657 106.097 24.7412C106.097 23.819 105.774 23.0345 105.129 22.3901C104.467 21.7301 103.473 20.7411 102.15 19.4211Z" fill="white"/>
<path d="M56.3248 19.9342C56.1564 20.0397 55.9814 20.1409 55.7975 20.2309C55.6135 20.2931 55.4162 20.3375 55.2011 20.3686C54.8343 20.4309 54.4742 20.4231 54.1231 20.3453C53.7719 20.2675 53.4352 20.1164 53.1131 19.8875L52.9982 19.8197C52.9224 19.7742 52.7987 19.6831 52.6326 19.5453L52.6092 19.522C52.5022 19.4153 52.3728 19.2864 52.219 19.1331C52.0663 19.0119 51.889 18.8508 51.6917 18.6542C50.9571 17.9219 50.4532 17.2519 50.1778 16.643C49.9337 16.0341 49.9404 15.203 50.2012 14.1507C50.3696 13.3729 50.7586 12.6651 51.3695 12.0251C51.9804 11.3851 52.462 10.8895 52.8132 10.5395C53.9291 9.42727 55.6102 7.75167 57.8576 5.51162C57.4908 5.14605 56.9401 4.59715 56.2066 3.86602C56.0996 3.75935 56.0371 3.62268 56.0227 3.45379C56.0227 3.27045 56.0851 3.11934 56.2066 2.99822C56.3437 2.86155 56.4819 2.73933 56.6202 2.63266C56.7428 2.54155 56.8866 2.4571 57.0561 2.38154C57.269 2.29043 57.4853 2.21376 57.6982 2.15376C57.9122 2.12265 58.1263 2.1082 58.3403 2.1082C58.6457 2.1082 58.9445 2.14598 59.2343 2.22154C59.5253 2.32821 59.7995 2.48043 60.0604 2.67933C60.1206 2.70933 60.1752 2.74711 60.2209 2.79266C60.2967 2.83822 60.3592 2.88378 60.4049 2.92933C61.0158 2.32043 61.9332 1.40596 63.1573 0.185933C63.2799 0.0637083 63.4315 0.00259571 63.6143 0.00259571C63.7827 -0.0129602 63.9276 0.0414855 64.0502 0.163711C64.631 0.742614 64.922 1.44485 64.922 2.26598C64.922 3.08711 64.631 3.79046 64.0502 4.36826C63.7905 4.62715 63.4081 5.00827 62.9031 5.51162C62.9343 5.54273 62.9644 5.57162 62.9945 5.60273C63.0101 5.61829 63.0324 5.64051 63.0625 5.67051C63.8105 6.41608 64.9276 7.52944 66.4102 9.00726C66.5317 9.12837 66.5997 9.27393 66.6153 9.44171C66.6153 9.62505 66.5529 9.77616 66.4314 9.89728C66.3088 10.0195 66.1795 10.1328 66.0412 10.2395C65.903 10.3462 65.7514 10.4384 65.5819 10.514C65.369 10.6051 65.1539 10.6673 64.9409 10.6973C64.728 10.7584 64.5207 10.7806 64.3222 10.7651C64.0168 10.7651 63.7113 10.7195 63.4048 10.6284C63.1138 10.5529 62.8384 10.4151 62.5787 10.2173C62.5174 10.1873 62.4561 10.1417 62.3948 10.0806C62.3346 10.0195 62.2799 9.96617 62.2342 9.92061C61.9589 9.64616 61.5386 9.22726 60.9723 8.6628C60.8965 8.58725 60.7806 8.47169 60.6289 8.32057C60.5977 8.28946 60.5609 8.25279 60.5141 8.20613C60.4673 8.15946 60.4227 8.11501 60.377 8.06946C59.2488 9.19837 57.5677 10.8751 55.3348 13.0996C55.3036 13.1307 55.259 13.1751 55.1977 13.2362C54.6938 13.7385 54.3181 14.2185 54.074 14.6752C53.8444 15.1463 53.7752 15.5063 53.8667 15.7496C53.9581 16.0241 54.1955 16.3374 54.5779 16.6874C54.9603 17.0375 55.3036 17.3197 55.6091 17.533C55.8844 17.7452 56.3125 18.0508 56.8922 18.4464C57.0148 18.5375 57.0839 18.6675 57.0995 18.8353C57.1308 18.9875 57.0995 19.1397 57.0081 19.2931C56.9468 19.3842 56.871 19.4764 56.7796 19.5675C56.7484 19.5986 56.7183 19.6275 56.6882 19.6586C56.5678 19.7508 56.4452 19.842 56.3248 19.9342Z" fill="white"/>
<path d="M77.1924 29.1683C76.5815 29.7772 75.6707 30.685 74.4634 31.8884C73.7756 32.5739 73.0041 33.0695 72.148 33.3739C71.2762 33.694 70.39 33.8451 69.4892 33.8306C68.6632 33.8017 67.8616 33.6262 67.0824 33.3051C66.2875 32.9684 65.5763 32.4895 64.9498 31.8639C64.7213 31.6361 64.3913 31.3072 63.9632 30.8806C63.5965 30.515 63.0536 29.9739 62.3356 29.2583C62.1216 29.045 61.7927 28.7172 61.3491 28.2749C60.7225 27.6505 60.241 26.9416 59.9043 26.1493C59.5665 25.3571 59.3926 24.5571 59.377 23.7504C59.3458 22.8359 59.4996 21.9526 59.8363 21.1003C60.1417 20.247 60.6389 19.4781 61.3268 18.7925C61.9377 18.1836 62.8484 17.2758 64.0557 16.0724C64.728 15.4024 65.4994 14.9068 66.3712 14.5868C67.2273 14.2524 68.1058 14.1079 69.0065 14.1524C69.8158 14.1679 70.6274 14.3357 71.4367 14.6546C72.216 14.9757 72.9194 15.4468 73.5459 16.0724C73.7588 16.2846 74.0888 16.6135 74.5325 17.0558C74.8993 17.4213 75.441 17.9614 76.1601 18.678C76.373 18.8903 76.703 19.2192 77.1467 19.6614C77.7732 20.2859 78.2548 20.9948 78.5914 21.787C78.898 22.5792 79.0641 23.387 79.0953 24.2093C79.141 25.1071 78.9961 25.9838 78.6594 26.836C78.3373 27.7049 77.849 28.4827 77.1924 29.1683ZM74.6005 26.5849C75.1969 25.9904 75.4934 25.2671 75.4934 24.4137C75.4934 23.5604 75.1958 22.837 74.6005 22.2426C74.372 22.0148 74.042 21.6859 73.6139 21.2592C73.2472 20.8936 72.7043 20.3525 71.9863 19.6369C71.7723 19.4236 71.4434 19.0958 70.9997 18.6536C70.4033 18.0591 69.6765 17.7625 68.8215 17.7636C67.9653 17.7636 67.2396 18.0602 66.6432 18.6536C66.0323 19.2625 65.1137 20.1781 63.8908 21.397C63.2944 21.9915 62.9967 22.7159 62.9978 23.5682C62.9978 24.4215 63.2955 25.1449 63.8908 25.7393C64.1048 25.9538 64.4337 26.2804 64.8773 26.7227C65.2441 27.0882 65.7859 27.6283 66.5049 28.3449C66.719 28.5583 67.0478 28.8861 67.4915 29.3283C68.0879 29.9228 68.8137 30.2183 69.6698 30.2183C70.526 30.2183 71.2517 29.9216 71.8481 29.3283C72.4601 28.7194 73.3765 27.8049 74.6005 26.5849Z" fill="white"/>
<path d="M90.0311 47.4017C89.3433 48.0873 88.5785 48.5895 87.738 48.9095C86.8662 49.2295 85.98 49.3807 85.0792 49.3673C84.2532 49.3373 83.4505 49.1607 82.6724 48.8418C81.8776 48.5051 81.1663 48.0262 80.5398 47.4017C80.3113 47.1739 79.9813 46.845 79.5532 46.4184C79.1865 46.0528 78.6425 45.5117 77.9257 44.7961C77.7116 44.5828 77.3828 44.255 76.9391 43.8127C76.297 43.1727 75.8154 42.4638 75.4943 41.6871C75.1565 40.8949 74.9826 40.0949 74.967 39.2882C74.9358 38.3737 75.0818 37.4826 75.4029 36.6148C75.724 35.777 76.2278 35.0148 76.9157 34.3292C77.7417 33.5058 78.9713 32.2802 80.6078 30.6491C80.8676 30.3902 81.2644 29.9946 81.7995 29.4613C82.2722 28.9902 82.9834 28.2813 83.9321 27.3357C84.0536 27.2146 84.2064 27.1523 84.3892 27.1523C84.5731 27.1523 84.718 27.2068 84.8251 27.3135C84.9622 27.4501 85.077 27.5957 85.1695 27.7479C85.2621 27.8701 85.3512 28.0068 85.4449 28.159C85.5218 28.3557 85.5831 28.5702 85.6288 28.7979C85.689 29.0102 85.7202 29.2402 85.7202 29.4846C85.7202 29.7891 85.6745 30.0935 85.5831 30.3991C85.4761 30.6891 85.339 30.9624 85.1706 31.2224C85.1249 31.268 85.0714 31.3213 85.0101 31.3824C84.9644 31.458 84.9109 31.528 84.8496 31.5891C84.7426 31.6958 84.582 31.8558 84.3669 32.0702C84.4583 31.9791 84.5954 31.8425 84.7794 31.6591C84.5196 31.918 84.1294 32.3069 83.6099 32.8247C83.5341 32.9003 83.4182 33.0158 83.2666 33.1669C83.2209 33.2125 83.144 33.2892 83.0381 33.3947C82.9154 33.5169 82.8318 33.6014 82.7861 33.6458C82.0671 34.3625 80.9746 35.4514 79.5064 36.9148C78.91 37.5093 78.6112 38.2326 78.6135 39.086C78.6135 39.9393 78.9111 40.6627 79.5075 41.2582C79.7205 41.4705 80.0504 41.7994 80.4941 42.2416C80.8453 42.5916 81.3882 43.1327 82.1217 43.8639C82.3346 44.0761 82.6646 44.405 83.1083 44.8472C83.7047 45.4417 84.4293 45.7383 85.2866 45.7372C86.1427 45.7372 86.8685 45.4406 87.4649 44.8472C88.1984 44.115 89.2987 43.0194 90.7669 41.556C90.8126 41.5105 90.8884 41.4349 90.9954 41.3282C91.1024 41.2216 91.1871 41.1382 91.2473 41.0771C91.3231 41.0005 91.4391 40.886 91.5907 40.7338C91.866 40.4593 92.2707 40.056 92.8058 39.5226C92.6988 39.6293 92.5383 39.7893 92.3231 40.0038C92.4301 39.8971 92.5906 39.7371 92.8058 39.5226C92.866 39.4626 92.9273 39.4015 92.9897 39.3404C93.0655 39.2949 93.1358 39.2415 93.1971 39.1804C93.4412 38.9993 93.7166 38.8604 94.0231 38.7693C94.3141 38.6626 94.6118 38.6082 94.9172 38.6093C95.1312 38.6093 95.3453 38.6382 95.5593 38.7004C95.7879 38.746 96.003 38.8071 96.2003 38.8837C96.3542 38.9748 96.498 39.0737 96.6362 39.1815C96.7744 39.2571 96.9104 39.3637 97.0487 39.5026C97.1702 39.6238 97.2248 39.7682 97.2103 39.9371C97.2259 40.1049 97.1635 40.2571 97.0264 40.3927C96.5515 40.866 95.8414 41.5738 94.8938 42.5183C93.8214 43.6094 92.2016 45.2394 90.0311 47.4017Z" fill="white"/>
<path d="M100.79 63.7501C100.805 64.1312 100.736 64.5035 100.585 64.869C100.447 65.2202 100.233 65.5391 99.9425 65.8291C99.8199 65.9513 99.6749 66.0179 99.5066 66.0335C99.3227 66.0335 99.171 65.9713 99.0495 65.8502C98.209 65.0124 96.9482 63.7557 95.266 62.079C94.684 61.499 93.8134 60.6312 92.6518 59.4745C92.0253 58.8489 91.5437 58.1411 91.207 57.3489C90.8692 56.5566 90.6953 55.7566 90.6797 54.9499C90.6485 54.0354 90.8024 53.1521 91.139 52.2998C91.4445 51.4465 91.9417 50.6776 92.6295 49.992C93.2404 49.3831 94.1512 48.4753 95.3585 47.2719C96.0307 46.6019 96.8021 46.1064 97.6739 45.7864C98.53 45.4519 99.4085 45.3063 100.309 45.3519C101.119 45.3675 101.922 45.543 102.716 45.8775C103.48 46.183 104.16 46.6308 104.757 47.2264C104.788 47.2575 104.817 47.2864 104.849 47.3175C105.428 47.8964 106.292 48.7564 107.439 49.8998C108.28 50.7376 109.556 52.0098 111.269 53.7165C111.376 53.8232 111.429 53.9688 111.43 54.151C111.446 54.3188 111.384 54.471 111.246 54.6066C110.971 54.881 110.649 55.0932 110.283 55.2466C109.916 55.3988 109.541 55.4677 109.16 55.451C108.762 55.451 108.388 55.3832 108.037 55.2466C107.67 55.0944 107.341 54.8732 107.05 54.5832C106.575 54.1099 105.865 53.4021 104.918 52.4576C104.336 51.8776 103.464 51.0087 102.304 49.852C101.707 49.2575 100.98 48.9609 100.125 48.962C99.2691 48.962 98.5434 49.2587 97.947 49.852C97.3361 50.4609 96.4175 51.3765 95.1946 52.5954C94.5982 53.1899 94.2983 53.9132 94.3017 54.7666C94.3017 55.6188 94.5993 56.3433 95.1946 56.9377C95.7743 57.5166 96.6383 58.3767 97.7854 59.52C98.2603 59.9922 98.9693 60.7 99.918 61.6456C100.209 61.9356 100.429 62.2623 100.583 62.629C100.704 62.9957 100.774 63.369 100.79 63.7501Z" fill="white"/>
<path d="M121.978 73.8059C121.504 74.2781 120.786 74.9937 119.823 75.9537C119.119 76.6548 118.049 77.7215 116.613 79.1527C116.338 79.4271 116.016 79.6393 115.65 79.7927C115.268 79.9293 114.892 79.9993 114.528 79.9971C114.145 80.0127 113.771 79.9438 113.404 79.7927C113.053 79.656 112.732 79.4427 112.441 79.1527C112.318 79.0304 112.257 78.8793 112.257 78.6971C112.241 78.5293 112.296 78.3849 112.418 78.2626C113.504 77.1804 115.124 75.5659 117.28 73.417C117.768 72.9303 118.487 72.2136 119.435 71.2691C120.031 70.6747 120.328 69.9513 120.328 69.098C120.328 68.2446 120.03 67.5213 119.435 66.9268C119.328 66.8201 119.167 66.6601 118.953 66.4479C118.371 65.8679 117.509 65.0079 116.363 63.8656C115.766 63.2712 115.039 62.9745 114.184 62.9756C113.313 62.96 112.58 63.25 111.984 63.8445C111.647 64.179 111.15 64.6756 110.493 65.3301C110.433 65.3901 110.333 65.4901 110.195 65.6279C109.4 66.4201 108.2 67.6157 106.595 69.2157C106.32 69.4902 105.997 69.7024 105.632 69.8558C105.265 70.008 104.899 70.0835 104.531 70.0835C104.149 70.0991 103.776 70.0302 103.409 69.8791C103.057 69.7424 102.729 69.5202 102.422 69.2157C102.315 69.1091 102.253 68.9724 102.238 68.8035C102.238 68.6213 102.301 68.4691 102.422 68.3479C103.599 67.1746 105.349 65.4312 107.673 63.1145C108.605 62.1856 110.004 60.7911 111.869 58.9322C113.413 57.3944 115.728 55.0854 118.817 52.0076C118.939 51.8864 119.092 51.8242 119.274 51.8242C119.457 51.8242 119.603 51.8787 119.71 51.9853C120.307 52.5798 120.603 53.2876 120.604 54.1109C120.604 54.9332 120.306 55.6432 119.71 56.2365C118.931 57.0132 117.762 58.1788 116.202 59.7333C116.69 59.8855 117.165 60.0977 117.625 60.3722C118.099 60.6622 118.533 61.0055 118.931 61.4022C119.145 61.6167 119.474 61.9433 119.918 62.3856C120.377 62.8434 121.071 63.5356 122.005 64.4656C122.433 64.8923 122.792 65.3401 123.083 65.8134C123.358 66.3012 123.572 66.8046 123.725 67.3224C123.816 67.5968 123.877 67.8713 123.909 68.1446C123.954 68.4346 123.977 68.7157 123.977 68.9913C123.991 69.0669 124 69.1357 124 69.198C123.984 69.2758 123.977 69.3424 123.977 69.4046C123.961 70.1213 123.824 70.8225 123.563 71.5069C123.318 72.208 122.952 72.8481 122.462 73.427C122.401 73.487 122.347 73.5414 122.301 73.587C122.27 73.6181 122.246 73.6414 122.233 73.6547C122.153 73.7225 122.068 73.7747 121.978 73.8059Z" fill="white"/>
</svg>
