<svg width="175" height="80" viewBox="0 0 175 80" fill="none" xmlns="http://www.w3.org/2000/svg">
<g clip-path="url(#clip0)">
<path d="M82.6271 57.7686H84.4306V53.7634C84.4306 53.3012 84.4014 51.8041 86.0591 51.8041V50.0758C85.3032 49.9892 84.6615 50.3358 84.2848 50.9688H84.2556V50.3358H82.6271V57.7686ZM75.5275 53.2459C75.8191 52.3529 76.6042 51.7776 77.6226 51.7776C78.5535 51.7776 79.3386 52.2951 79.6011 53.2459H75.5275ZM81.4629 54.8297C81.4921 54.5408 81.4921 54.2833 81.4921 54.0522C81.4921 51.8041 79.9219 50.0758 77.6226 50.0758C74.8882 50.0758 73.6073 52.3818 73.6073 54.0811C73.6073 55.8093 74.8882 57.9997 77.5934 57.9997C77.9143 57.9997 80.2112 57.9708 81.2296 55.5782H79.1928C78.7577 56.1246 78.0869 56.2979 77.5059 56.2979C76.5459 56.2979 75.7608 55.7227 75.5566 54.8297H81.4629ZM65.5184 57.7686H66.6535L68.0803 52.9281L69.507 57.7686H70.6421L73.3181 50.3358H71.4271L70.0587 54.8586L68.7778 50.3358H67.3803L66.0994 54.8586L64.7309 50.3358H62.84L65.5184 57.7686ZM58.3605 51.7752C59.6997 51.7752 60.5431 52.8415 60.5431 54.0522C60.5431 55.2629 59.6705 56.3003 58.3605 56.3003C56.9921 56.3003 56.1487 55.2629 56.1487 54.0522C56.1487 52.8415 56.9921 51.7752 58.3605 51.7752ZM58.3605 50.0758C56.0612 50.0758 54.3452 51.8618 54.3452 54.0522C54.3452 56.2137 56.0612 57.9997 58.3605 57.9997C60.6306 57.9997 62.3174 56.2137 62.3174 54.0522C62.3174 51.8618 60.6306 50.0758 58.3605 50.0758ZM51.465 57.7686H53.2684V47.7988H51.465V57.7686ZM45.1504 57.7686H47.0122V53.6767H50.0966V51.9196H47.0122V49.5848H50.2424V47.7988H45.1504V57.7686Z" fill="white"/>
<path d="M123.915 53.2459C124.206 52.3529 124.991 51.7776 125.981 51.7776C126.882 51.7776 127.697 52.2951 127.959 53.2459H123.915ZM129.821 54.8297C129.85 54.5408 129.85 54.2833 129.85 54.0522C129.85 51.8041 128.28 50.0758 125.981 50.0758C123.246 50.0758 121.965 52.3818 121.965 54.0811C121.965 55.8093 123.246 57.9997 125.951 57.9997C126.301 57.9997 128.598 57.9708 129.587 55.5782H127.58C127.113 56.1246 126.445 56.2979 125.864 56.2979C124.933 56.2979 124.177 55.7227 123.915 54.8297H129.821ZM115.855 55.4074C115.855 56.7625 116.844 57.9997 118.589 57.9997C120.218 57.9997 121.294 56.8467 121.294 55.4362C121.294 53.8524 120.014 53.4192 119.083 53.217C118.645 53.1303 117.918 52.9859 117.918 52.3818C117.918 52.064 118.123 51.7776 118.616 51.7776C119.053 51.7776 119.284 52.0664 119.284 52.3529H121.088C121.03 50.9977 120.011 50.0758 118.643 50.0758C116.898 50.0758 116.113 51.3443 116.113 52.3818C116.113 53.8211 117.306 54.2833 118.033 54.5144C118.295 54.5721 118.555 54.6588 118.789 54.7743C119.197 54.9187 119.486 55.092 119.486 55.5518C119.486 56.0115 119.136 56.3003 118.643 56.3003C118.12 56.3003 117.683 55.9537 117.683 55.4074H115.855ZM114.866 50.3358H113.033V54.11C113.033 54.9452 112.975 56.3003 111.521 56.3003C110.068 56.3003 109.98 54.9452 109.98 54.11V50.3358H108.206V54.3411C108.206 55.5229 108.381 57.9997 111.232 57.9997C111.699 57.9997 112.542 57.8553 113.181 57.0778V57.7686H114.868V50.3358H114.866ZM103.08 51.7752C104.448 51.7752 105.292 52.8415 105.292 54.0522C105.292 55.2629 104.448 56.3003 103.08 56.3003C101.77 56.3003 100.897 55.2629 100.897 54.0522C100.9 52.8415 101.743 51.7752 103.08 51.7752ZM103.08 50.0758C100.81 50.0758 99.1229 51.8618 99.1229 54.0522C99.1229 56.2137 100.81 57.9997 103.08 57.9997C105.379 57.9997 107.095 56.2137 107.095 54.0522C107.095 51.8618 105.438 50.0758 103.08 50.0758ZM90.4531 57.7686H92.3149V53.619H95.9802V57.7686H97.842V47.7988H95.9802V51.8041H92.3149V47.7988H90.4531V57.7686Z" fill="white"/>
<path d="M10.3299 23C4.47951 23 0 27.4385 0 33.2875C0 39.1076 4.50868 43.5173 10.3299 43.5173C15.5677 43.5173 19.7288 39.9742 20.5431 35.0446C20.6597 34.2383 20.6889 33.4319 20.6889 32.6232H8.87639V35.0446H17.8378C17.1087 38.5877 14.1701 41.1247 10.3299 41.1247C5.90625 41.1247 2.67847 37.7236 2.67847 33.2875C2.67847 28.849 5.90868 25.4214 10.3299 25.4214C13.5017 25.4214 16.0611 27.1497 17.2545 29.7733H20.0764C18.708 25.7656 14.9552 23 10.3299 23Z" fill="white"/>
<path d="M33.0525 25.4214C37.5053 25.4214 40.7331 28.8514 40.7331 33.2875C40.7331 37.7236 37.5029 41.1247 33.0525 41.1247C28.6289 41.1247 25.4011 37.7236 25.4011 33.2875C25.4011 28.849 28.6313 25.4214 33.0525 25.4214ZM33.0525 23C27.2046 23 22.7227 27.4385 22.7227 33.2875C22.7227 39.1076 27.2338 43.5173 33.0525 43.5173C38.8713 43.5173 43.3824 39.1076 43.3824 33.2875C43.3824 27.4385 38.9296 23 33.0525 23Z" fill="white"/>
<path d="M55.7498 25.4214C60.2026 25.4214 63.4303 28.8514 63.4303 33.2875C63.4303 37.7236 60.2001 41.1247 55.7498 41.1247C51.3262 41.1247 48.0984 37.7236 48.0984 33.2875C48.096 28.849 51.3262 25.4214 55.7498 25.4214ZM55.7498 23C49.9019 23 45.4199 27.4385 45.4199 33.2875C45.4199 39.1076 49.9578 43.5173 55.7498 43.5173C61.5685 43.5173 66.1088 39.1076 66.1088 33.2875C66.1064 27.4385 61.6269 23 55.7498 23Z" fill="white"/>
<path d="M77.7753 26.0855C82.2281 26.0855 85.1083 28.8511 85.1083 33.2896C85.1083 37.7257 82.2281 40.436 77.7753 40.436H72.3042V26.0855H77.7753ZM77.7753 42.8261C83.5941 42.8261 87.7844 39.1097 87.7844 33.2896C87.7844 27.4406 83.6524 23.6953 77.7753 23.6953H69.4531V42.8285H77.7753V42.8261Z" fill="white"/>
<path d="M98.0699 42.8246L89.2227 23.6914H92.3654L99.9876 40.4032L107.61 23.6914H110.753L101.908 42.8246H98.0699Z" fill="white"/>
<path d="M114.422 31.8168C115.061 28.1004 118.116 25.3901 121.93 25.3901C125.364 25.3901 128.419 27.8405 129.175 31.8168H114.422ZM132.084 34.2094C132.114 29.1667 129.406 23 121.93 23C115.209 23 111.629 28.447 111.629 33.2875C111.629 39.1365 116.111 43.5173 121.93 43.5173C126.409 43.5173 130.018 40.896 131.618 36.6886H128.825C127.603 39.3676 125.043 41.1247 121.93 41.1247C117.768 41.1247 114.742 38.0991 114.422 34.2094H132.084Z" fill="white"/>
<path d="M137.117 31.8168C137.757 28.1004 140.841 25.3901 144.625 25.3901C148.06 25.3901 151.115 27.8405 151.9 31.8168H137.117ZM154.778 34.2094C154.807 29.1667 152.102 23 144.623 23C137.902 23 134.322 28.447 134.322 33.2875C134.322 39.1365 138.802 43.5173 144.623 43.5173C149.102 43.5173 152.712 40.896 154.311 36.6886H151.518C150.298 39.3676 147.737 41.1247 144.623 41.1247C140.462 41.1247 137.436 38.0991 137.115 34.2094H154.778Z" fill="white"/>
<path d="M158.242 42.8246H161.006V28.0144L172.237 42.8246H175.001V23.6914H172.237V38.1839L161.239 23.6914H158.242V42.8246Z" fill="white"/>
</g>
<defs>
<clipPath id="clip0">
<rect width="175" height="80" fill="white"/>
</clipPath>
</defs>
</svg>
