<svg width="338" height="51" viewBox="0 0 338 51" fill="none" xmlns="http://www.w3.org/2000/svg">
<path d="M5.84481 51L73 42.1997L67.1552 0L0 8.80025L5.84481 51Z" fill="#81007F"/>
<path d="M51.456 26.3195C52.736 26.7675 53.7387 27.4715 54.464 28.4315C55.1893 29.3702 55.552 30.5115 55.552 31.8555C55.552 33.8182 54.7627 35.3328 53.184 36.3995C51.6053 37.4662 49.3227 37.9995 46.336 37.9995H34.24V15.5995H45.696C48.5547 15.5995 50.7307 16.1328 52.224 17.1995C53.7173 18.2448 54.464 19.6635 54.464 21.4555C54.464 22.5222 54.1973 23.4822 53.664 24.3355C53.152 25.1675 52.416 25.8288 51.456 26.3195ZM40.512 20.1755V24.4955H44.864C46.9973 24.4955 48.064 23.7702 48.064 22.3195C48.064 20.8902 46.9973 20.1755 44.864 20.1755H40.512ZM45.824 33.4235C48.0427 33.4235 49.152 32.6662 49.152 31.1515C49.152 29.6368 48.0427 28.8795 45.824 28.8795H40.512V33.4235H45.824ZM58.5458 20.6555H64.6258V37.9995H58.5458V20.6555ZM61.5858 18.7355C60.4764 18.7355 59.5804 18.4262 58.8978 17.8075C58.2151 17.1888 57.8738 16.4208 57.8738 15.5035C57.8738 14.5862 58.2151 13.8182 58.8978 13.1995C59.5804 12.5808 60.4764 12.2715 61.5858 12.2715C62.6951 12.2715 63.5911 12.5702 64.2738 13.1675C64.9564 13.7435 65.2978 14.4902 65.2978 15.4075C65.2978 16.3675 64.9564 17.1675 64.2738 17.8075C63.5911 18.4262 62.6951 18.7355 61.5858 18.7355ZM83.681 33.4555V37.9995H67.681V34.4155L75.713 25.1675H67.905V20.6555H83.361V24.2075L75.329 33.4555H83.681ZM97.6543 20.3675C99.8089 20.3675 101.537 21.0075 102.838 22.2875C104.161 23.5675 104.822 25.4982 104.822 28.0795V37.9995H98.7423V29.0715C98.7423 26.7035 97.7929 25.5195 95.8943 25.5195C94.8489 25.5195 94.0063 25.8608 93.3663 26.5435C92.7476 27.2262 92.4383 28.2502 92.4383 29.6155V37.9995H86.3583V20.6555H92.1503V22.5435C92.8329 21.8395 93.6436 21.3062 94.5823 20.9435C95.5209 20.5595 96.5449 20.3675 97.6543 20.3675ZM108.64 20.6555H114.72V37.9995H108.64V20.6555ZM111.68 18.7355C110.57 18.7355 109.674 18.4262 108.992 17.8075C108.309 17.1888 107.968 16.4208 107.968 15.5035C107.968 14.5862 108.309 13.8182 108.992 13.1995C109.674 12.5808 110.57 12.2715 111.68 12.2715C112.789 12.2715 113.685 12.5702 114.368 13.1675C115.05 13.7435 115.392 14.4902 115.392 15.4075C115.392 16.3675 115.05 17.1675 114.368 17.8075C113.685 18.4262 112.789 18.7355 111.68 18.7355ZM129.967 20.3675C132.121 20.3675 133.849 21.0075 135.151 22.2875C136.473 23.5675 137.135 25.4982 137.135 28.0795V37.9995H131.055V29.0715C131.055 26.7035 130.105 25.5195 128.207 25.5195C127.161 25.5195 126.319 25.8608 125.679 26.5435C125.06 27.2262 124.751 28.2502 124.751 29.6155V37.9995H118.671V20.6555H124.463V22.5435C125.145 21.8395 125.956 21.3062 126.895 20.9435C127.833 20.5595 128.857 20.3675 129.967 20.3675ZM159.858 20.6555V34.8315C159.858 38.0528 158.983 40.4635 157.234 42.0635C155.485 43.6848 152.967 44.4955 149.682 44.4955C147.975 44.4955 146.375 44.3035 144.882 43.9195C143.389 43.5355 142.119 42.9702 141.074 42.2235L143.282 37.9675C143.986 38.5435 144.871 38.9915 145.938 39.3115C147.026 39.6528 148.093 39.8235 149.138 39.8235C150.738 39.8235 151.911 39.4715 152.658 38.7675C153.405 38.0635 153.778 37.0182 153.778 35.6315V35.0555C152.605 36.4208 150.887 37.1035 148.626 37.1035C147.09 37.1035 145.671 36.7622 144.37 36.0795C143.069 35.3755 142.034 34.3942 141.266 33.1355C140.498 31.8555 140.114 30.3835 140.114 28.7195C140.114 27.0768 140.498 25.6262 141.266 24.3675C142.034 23.0875 143.069 22.1062 144.37 21.4235C145.671 20.7195 147.09 20.3675 148.626 20.3675C151.101 20.3675 152.914 21.1675 154.066 22.7675V20.6555H159.858ZM150.066 32.2715C151.154 32.2715 152.05 31.9408 152.754 31.2795C153.479 30.6182 153.842 29.7648 153.842 28.7195C153.842 27.6742 153.49 26.8315 152.786 26.1915C152.082 25.5302 151.175 25.1995 150.066 25.1995C148.957 25.1995 148.039 25.5302 147.314 26.1915C146.61 26.8315 146.258 27.6742 146.258 28.7195C146.258 29.7648 146.621 30.6182 147.346 31.2795C148.071 31.9408 148.978 32.2715 150.066 32.2715ZM172.341 44.4955C170.57 44.4955 169.162 44.1968 168.117 43.5995L169.653 39.2795C170.208 39.6208 170.837 39.7915 171.541 39.7915C172.096 39.7915 172.533 39.5995 172.853 39.2155C173.173 38.8315 173.333 38.2662 173.333 37.5195V20.6555H179.413V37.5515C179.413 39.6848 178.784 41.3702 177.525 42.6075C176.288 43.8662 174.56 44.4955 172.341 44.4955ZM176.373 18.7355C175.264 18.7355 174.368 18.4262 173.685 17.8075C173.002 17.1888 172.661 16.4208 172.661 15.5035C172.661 14.5862 173.002 13.8182 173.685 13.1995C174.368 12.5808 175.264 12.2715 176.373 12.2715C177.482 12.2715 178.378 12.5702 179.061 13.1675C179.744 13.7435 180.085 14.4902 180.085 15.4075C180.085 16.3675 179.744 17.1675 179.061 17.8075C178.378 18.4262 177.482 18.7355 176.373 18.7355ZM190.719 20.3675C193.599 20.3675 195.796 21.0288 197.311 22.3515C198.826 23.6528 199.583 25.6582 199.583 28.3675V37.9995H193.919V35.7595C193.044 37.4448 191.338 38.2875 188.799 38.2875C187.455 38.2875 186.292 38.0528 185.311 37.5835C184.33 37.1142 183.583 36.4848 183.071 35.6955C182.58 34.8848 182.335 33.9675 182.335 32.9435C182.335 31.3008 182.964 30.0315 184.223 29.1355C185.482 28.2182 187.423 27.7595 190.047 27.7595H193.503C193.396 25.9248 192.17 25.0075 189.823 25.0075C188.991 25.0075 188.148 25.1462 187.295 25.4235C186.442 25.6795 185.716 26.0422 185.119 26.5115L183.071 22.3835C184.031 21.7435 185.194 21.2528 186.559 20.9115C187.946 20.5488 189.332 20.3675 190.719 20.3675ZM190.495 34.4475C191.199 34.4475 191.818 34.2768 192.351 33.9355C192.884 33.5942 193.268 33.0928 193.503 32.4315V30.9275H190.879C189.108 30.9275 188.223 31.5142 188.223 32.6875C188.223 33.2208 188.426 33.6475 188.831 33.9675C189.236 34.2875 189.791 34.4475 190.495 34.4475ZM226.013 20.3675C228.146 20.3675 229.842 21.0075 231.101 22.2875C232.381 23.5675 233.021 25.4982 233.021 28.0795V37.9995H226.941V29.0715C226.941 27.8555 226.706 26.9595 226.237 26.3835C225.789 25.8075 225.149 25.5195 224.317 25.5195C223.399 25.5195 222.663 25.8395 222.109 26.4795C221.554 27.1195 221.277 28.0902 221.277 29.3915V37.9995H215.197V29.0715C215.197 26.7035 214.322 25.5195 212.573 25.5195C211.634 25.5195 210.887 25.8395 210.333 26.4795C209.778 27.1195 209.501 28.0902 209.501 29.3915V37.9995H203.421V20.6555H209.213V22.4795C209.853 21.7755 210.61 21.2528 211.485 20.9115C212.381 20.5488 213.351 20.3675 214.397 20.3675C215.613 20.3675 216.701 20.5915 217.661 21.0395C218.621 21.4875 219.399 22.1702 219.997 23.0875C220.679 22.2128 221.543 21.5408 222.589 21.0715C223.634 20.6022 224.775 20.3675 226.013 20.3675ZM245.812 38.2875C243.956 38.2875 242.282 37.9035 240.788 37.1355C239.295 36.3675 238.122 35.3008 237.268 33.9355C236.436 32.5702 236.02 31.0235 236.02 29.2955C236.02 27.5888 236.436 26.0528 237.268 24.6875C238.122 23.3222 239.284 22.2662 240.756 21.5195C242.25 20.7515 243.935 20.3675 245.812 20.3675C247.69 20.3675 249.375 20.7515 250.868 21.5195C252.362 22.2662 253.524 23.3222 254.356 24.6875C255.188 26.0315 255.604 27.5675 255.604 29.2955C255.604 31.0235 255.188 32.5702 254.356 33.9355C253.524 35.3008 252.362 36.3675 250.868 37.1355C249.375 37.9035 247.69 38.2875 245.812 38.2875ZM245.812 33.4555C246.879 33.4555 247.754 33.0928 248.436 32.3675C249.119 31.6208 249.46 30.5968 249.46 29.2955C249.46 28.0155 249.119 27.0128 248.436 26.2875C247.754 25.5622 246.879 25.1995 245.812 25.1995C244.746 25.1995 243.871 25.5622 243.188 26.2875C242.506 27.0128 242.164 28.0155 242.164 29.2955C242.164 30.5968 242.506 31.6208 243.188 32.3675C243.871 33.0928 244.746 33.4555 245.812 33.4555ZM265.438 20.3675C268.318 20.3675 270.515 21.0288 272.03 22.3515C273.544 23.6528 274.302 25.6582 274.302 28.3675V37.9995H268.638V35.7595C267.763 37.4448 266.056 38.2875 263.518 38.2875C262.174 38.2875 261.011 38.0528 260.03 37.5835C259.048 37.1142 258.302 36.4848 257.79 35.6955C257.299 34.8848 257.054 33.9675 257.054 32.9435C257.054 31.3008 257.683 30.0315 258.942 29.1355C260.2 28.2182 262.142 27.7595 264.766 27.7595H268.222C268.115 25.9248 266.888 25.0075 264.542 25.0075C263.71 25.0075 262.867 25.1462 262.014 25.4235C261.16 25.6795 260.435 26.0422 259.838 26.5115L257.79 22.3835C258.75 21.7435 259.912 21.2528 261.278 20.9115C262.664 20.5488 264.051 20.3675 265.438 20.3675ZM265.214 34.4475C265.918 34.4475 266.536 34.2768 267.07 33.9355C267.603 33.5942 267.987 33.0928 268.222 32.4315V30.9275H265.598C263.827 30.9275 262.942 31.5142 262.942 32.6875C262.942 33.2208 263.144 33.6475 263.55 33.9675C263.955 34.2875 264.51 34.4475 265.214 34.4475ZM300.732 20.3675C302.865 20.3675 304.561 21.0075 305.82 22.2875C307.1 23.5675 307.74 25.4982 307.74 28.0795V37.9995H301.66V29.0715C301.66 27.8555 301.425 26.9595 300.956 26.3835C300.508 25.8075 299.868 25.5195 299.036 25.5195C298.118 25.5195 297.382 25.8395 296.828 26.4795C296.273 27.1195 295.996 28.0902 295.996 29.3915V37.9995H289.916V29.0715C289.916 26.7035 289.041 25.5195 287.292 25.5195C286.353 25.5195 285.606 25.8395 285.052 26.4795C284.497 27.1195 284.22 28.0902 284.22 29.3915V37.9995H278.14V20.6555H283.932V22.4795C284.572 21.7755 285.329 21.2528 286.204 20.9115C287.1 20.5488 288.07 20.3675 289.116 20.3675C290.332 20.3675 291.42 20.5915 292.38 21.0395C293.34 21.4875 294.118 22.1702 294.716 23.0875C295.398 22.2128 296.262 21.5408 297.308 21.0715C298.353 20.6022 299.494 20.3675 300.732 20.3675ZM311.577 20.6555H317.657V37.9995H311.577V20.6555ZM314.617 18.7355C313.508 18.7355 312.612 18.4262 311.929 17.8075C311.246 17.1888 310.905 16.4208 310.905 15.5035C310.905 14.5862 311.246 13.8182 311.929 13.1995C312.612 12.5808 313.508 12.2715 314.617 12.2715C315.726 12.2715 316.622 12.5702 317.305 13.1675C317.988 13.7435 318.329 14.4902 318.329 15.4075C318.329 16.3675 317.988 17.1675 317.305 17.8075C316.622 18.4262 315.726 18.7355 314.617 18.7355ZM336.712 33.4555V37.9995H320.712V34.4155L328.744 25.1675H320.936V20.6555H336.392V24.2075L328.36 33.4555H336.712Z" fill="white"/>
</svg>
