{
  "project_info": {
    "project_number": "27963752615",
    "project_id": "messagenotification-44ec6",
    "storage_bucket": "messagenotification-44ec6.appspot.com"
  },
  "client": [
    {
      "client_info": {
        "mobilesdk_app_id": "1:27963752615:android:6998507c9cded5135b5b82",
        "android_client_info": {
          "package_name": "com.example.usenotification"
        }
      },
      "oauth_client": [
        {
          "client_id": "27963752615-j16nf1kr2q8s33tu32bhkck38rpvcpnt.apps.googleusercontent.com",
          "client_type": 3
        }
      ],
      "api_key": [
        {
          "current_key": "AIzaSyAf6sRcxF9gqWTa_Yo6KNj92BdIpVFAUng"
        }
      ],
      "services": {
        "appinvite_service": {
          "other_platform_oauth_client": [
            {
              "client_id": "27963752615-j16nf1kr2q8s33tu32bhkck38rpvcpnt.apps.googleusercontent.com",
              "client_type": 3
            }
          ]
        }
      }
    }
  ],
  "configuration_version": "1"
}