{
  "project_info": {
    "project_number": "914059201659",
    "project_id": "dynamiclink-c73bf",
    "storage_bucket": "dynamiclink-c73bf.appspot.com"
  },
  "client": [
    {
      "client_info": {
        "mobilesdk_app_id": "1:914059201659:android:01d0fc46fd54662b2e66de",
        "android_client_info": {
          "package_name": "com.example.clickablelink"
        }
      },
      "oauth_client": [
        {
          "client_id": "914059201659-k8b5nn1086kvbcfc62s612kk65492g9r.apps.googleusercontent.com",
          "client_type": 3
        }
      ],
      "api_key": [
        {
          "current_key": "AIzaSyAXbbWiDVCshtvGcBAkwIUhBLuzKofVYjU"
        }
      ],
      "services": {
        "appinvite_service": {
          "other_platform_oauth_client": [
            {
              "client_id": "914059201659-k8b5nn1086kvbcfc62s612kk65492g9r.apps.googleusercontent.com",
              "client_type": 3
            }
          ]
        }
      }
    }
  ],
  "configuration_version": "1"
}