<svg width="66" height="18" viewBox="0 0 66 18" fill="none" xmlns="http://www.w3.org/2000/svg">
<path d="M4.016 14.336H9.536V17H0.656V0.248H4.016V14.336ZM19.4476 17.168C17.8796 17.168 16.4396 16.8 15.1276 16.064C13.8156 15.328 12.7756 14.312 12.0076 13.016C11.2396 11.704 10.8556 10.224 10.8556 8.576C10.8556 6.944 11.2396 5.48 12.0076 4.184C12.7756 2.872 13.8156 1.848 15.1276 1.112C16.4396 0.375999 17.8796 0.0079999 19.4476 0.0079999C21.0316 0.0079999 22.4716 0.375999 23.7676 1.112C25.0796 1.848 26.1116 2.872 26.8636 4.184C27.6316 5.48 28.0156 6.944 28.0156 8.576C28.0156 10.224 27.6316 11.704 26.8636 13.016C26.1116 14.312 25.0796 15.328 23.7676 16.064C22.4556 16.8 21.0156 17.168 19.4476 17.168ZM19.4476 14.168C20.4556 14.168 21.3436 13.944 22.1116 13.496C22.8796 13.032 23.4796 12.376 23.9116 11.528C24.3436 10.68 24.5596 9.696 24.5596 8.576C24.5596 7.456 24.3436 6.48 23.9116 5.648C23.4796 4.8 22.8796 4.152 22.1116 3.704C21.3436 3.256 20.4556 3.032 19.4476 3.032C18.4396 3.032 17.5436 3.256 16.7596 3.704C15.9916 4.152 15.3916 4.8 14.9596 5.648C14.5276 6.48 14.3116 7.456 14.3116 8.576C14.3116 9.696 14.5276 10.68 14.9596 11.528C15.3916 12.376 15.9916 13.032 16.7596 13.496C17.5436 13.944 18.4396 14.168 19.4476 14.168ZM42.1794 5.288C41.7954 4.584 41.2674 4.048 40.5954 3.68C39.9234 3.312 39.1394 3.128 38.2434 3.128C37.2514 3.128 36.3714 3.352 35.6034 3.8C34.8354 4.248 34.2354 4.888 33.8034 5.72C33.3714 6.552 33.1554 7.512 33.1554 8.6C33.1554 9.72 33.3714 10.696 33.8034 11.528C34.2514 12.36 34.8674 13 35.6514 13.448C36.4354 13.896 37.3474 14.12 38.3874 14.12C39.6674 14.12 40.7154 13.784 41.5314 13.112C42.3474 12.424 42.8834 11.472 43.1394 10.256H37.3794V7.688H46.4514V10.616C46.2274 11.784 45.7474 12.864 45.0114 13.856C44.2754 14.848 43.3234 15.648 42.1554 16.256C41.0034 16.848 39.7074 17.144 38.2674 17.144C36.6514 17.144 35.1874 16.784 33.8754 16.064C32.5794 15.328 31.5554 14.312 30.8034 13.016C30.0674 11.72 29.6994 10.248 29.6994 8.6C29.6994 6.952 30.0674 5.48 30.8034 4.184C31.5554 2.872 32.5794 1.856 33.8754 1.136C35.1874 0.4 36.6434 0.0319996 38.2434 0.0319996C40.1314 0.0319996 41.7714 0.495999 43.1634 1.424C44.5554 2.336 45.5154 3.624 46.0434 5.288H42.1794ZM56.7133 17.168C55.1453 17.168 53.7053 16.8 52.3933 16.064C51.0813 15.328 50.0413 14.312 49.2733 13.016C48.5053 11.704 48.1213 10.224 48.1213 8.576C48.1213 6.944 48.5053 5.48 49.2733 4.184C50.0413 2.872 51.0813 1.848 52.3933 1.112C53.7053 0.375999 55.1453 0.0079999 56.7133 0.0079999C58.2973 0.0079999 59.7373 0.375999 61.0333 1.112C62.3453 1.848 63.3773 2.872 64.1293 4.184C64.8973 5.48 65.2813 6.944 65.2813 8.576C65.2813 10.224 64.8973 11.704 64.1293 13.016C63.3773 14.312 62.3453 15.328 61.0333 16.064C59.7213 16.8 58.2813 17.168 56.7133 17.168ZM56.7133 14.168C57.7213 14.168 58.6093 13.944 59.3773 13.496C60.1453 13.032 60.7453 12.376 61.1773 11.528C61.6093 10.68 61.8253 9.696 61.8253 8.576C61.8253 7.456 61.6093 6.48 61.1773 5.648C60.7453 4.8 60.1453 4.152 59.3773 3.704C58.6093 3.256 57.7213 3.032 56.7133 3.032C55.7053 3.032 54.8093 3.256 54.0253 3.704C53.2573 4.152 52.6573 4.8 52.2253 5.648C51.7933 6.48 51.5773 7.456 51.5773 8.576C51.5773 9.696 51.7933 10.68 52.2253 11.528C52.6573 12.376 53.2573 13.032 54.0253 13.496C54.8093 13.944 55.7053 14.168 56.7133 14.168Z" fill="#022180"/>
</svg>
