0,-1,401.00,460.00,35.00,-458.00,2
0,-1,422.00,506.00,88.00,-505.00,1
1,-1,401.00,456.00,37.00,-454.00,2
1,-1,423.00,504.00,95.00,-503.00,1
2,-1,413.00,505.00,118.00,-502.00,3
2,-1,401.00,452.00,41.00,-450.00,2
2,-1,430.00,505.00,103.00,-504.00,1
3,-1,400.00,444.00,50.00,-442.00,2
3,-1,430.00,502.00,116.00,-501.00,1
4,-1,399.00,443.00,57.00,-441.00,2
4,-1,435.00,502.00,117.00,-501.00,1
5,-1,401.00,441.00,58.00,-439.00,2
5,-1,444.00,499.00,119.00,-498.00,1
6,-1,404.00,440.00,60.00,-438.00,2
6,-1,453.00,495.00,122.00,-494.00,1
7,-1,407.00,440.00,60.00,-438.00,2
7,-1,461.00,490.00,130.00,-489.00,1
8,-1,410.00,432.00,62.00,-430.00,2
8,-1,474.00,485.00,134.00,-484.00,1
9,-1,411.00,428.00,67.00,-426.00,2
9,-1,484.00,475.00,136.00,-474.00,1
10,-1,416.00,422.00,65.00,-420.00,2
10,-1,496.00,472.00,139.00,-471.00,1
11,-1,424.00,422.00,64.00,-420.00,2
11,-1,507.00,463.00,143.00,-462.00,1
12,-1,428.00,414.00,66.00,-412.00,2
12,-1,517.00,455.00,142.00,-454.00,1
13,-1,432.00,408.00,68.00,-406.00,2
13,-1,530.00,446.00,134.00,-445.00,1
14,-1,436.00,400.00,72.00,-398.00,2
14,-1,542.00,434.00,124.00,-433.00,1
15,-1,442.00,394.00,74.00,-392.00,2
15,-1,557.00,422.00,108.00,-421.00,1
16,-1,448.00,386.00,74.00,-384.00,2
17,-1,452.00,377.00,81.00,-375.00,2
18,-1,460.00,369.00,80.00,-367.00,2
19,-1,468.00,361.00,82.00,-359.00,2
20,-1,476.00,355.00,86.00,-353.00,2
21,-1,483.00,345.00,90.00,-343.00,2
22,-1,491.00,335.00,91.00,-333.00,2
23,-1,498.00,324.00,97.00,-322.00,2
24,-1,505.00,313.00,104.00,-311.00,2
25,-1,515.00,302.00,110.00,-300.00,2
26,-1,527.00,291.00,117.00,-289.00,2
27,-1,535.00,279.00,114.00,-277.00,2
28,-1,549.00,269.00,104.00,-267.00,2
29,-1,564.00,256.00,92.00,-254.00,2
30,-1,401.00,451.00,44.00,-439.00,12
31,-1,401.00,451.00,49.00,-439.00,12
32,-1,401.00,448.00,54.00,-436.00,12
33,-1,402.00,442.00,55.00,-430.00,12
34,-1,405.00,439.00,57.00,-427.00,12
35,-1,408.00,434.00,59.00,-422.00,12
36,-1,411.00,430.00,61.00,-418.00,12
37,-1,413.00,425.00,63.00,-413.00,12
38,-1,418.00,421.00,63.00,-409.00,12
39,-1,423.00,415.00,64.00,-403.00,12
40,-1,428.00,412.00,65.00,-400.00,12
41,-1,433.00,406.00,66.00,-394.00,12
42,-1,435.00,397.00,71.00,-385.00,12
43,-1,441.00,393.00,73.00,-381.00,12
44,-1,447.00,386.00,74.00,-374.00,12
45,-1,452.00,377.00,76.00,-365.00,12
46,-1,458.00,372.00,78.00,-360.00,12
47,-1,464.00,372.00,85.00,-360.00,12
48,-1,472.00,358.00,85.00,-346.00,12
49,-1,478.00,348.00,89.00,-336.00,12
50,-1,487.00,336.00,89.00,-324.00,12
51,-1,493.00,325.00,90.00,-313.00,12
52,-1,498.00,318.00,98.00,-306.00,12
53,-1,511.00,316.00,101.00,-304.00,12
54,-1,516.00,298.00,106.00,-286.00,12
55,-1,528.00,289.00,114.00,-277.00,12
56,-1,540.00,276.00,102.00,-264.00,12
57,-1,550.00,263.00,97.00,-251.00,12
66,-1,401.00,458.00,49.00,-444.00,14
67,-1,402.00,452.00,53.00,-438.00,14
68,-1,402.00,448.00,56.00,-434.00,14
69,-1,405.00,443.00,58.00,-429.00,14
70,-1,408.00,437.00,58.00,-423.00,14
71,-1,410.00,432.00,60.00,-418.00,14
72,-1,413.00,427.00,64.00,-413.00,14
73,-1,402.00,503.00,69.00,-488.00,15
73,-1,416.00,423.00,67.00,-409.00,14
74,-1,404.00,503.00,72.00,-488.00,15
74,-1,424.00,422.00,66.00,-408.00,14
75,-1,408.00,503.00,74.00,-488.00,15
75,-1,428.00,414.00,69.00,-400.00,14
76,-1,407.00,502.00,82.00,-487.00,15
76,-1,432.00,406.00,71.00,-392.00,14
77,-1,404.00,502.00,93.00,-487.00,15
77,-1,435.00,401.00,75.00,-387.00,14
78,-1,409.00,502.00,97.00,-487.00,15
78,-1,442.00,396.00,75.00,-382.00,14
79,-1,418.00,504.00,97.00,-489.00,15
79,-1,447.00,389.00,77.00,-375.00,14
80,-1,418.00,505.00,105.00,-490.00,15
80,-1,451.00,382.00,83.00,-368.00,14
81,-1,431.00,504.00,97.00,-489.00,15
81,-1,459.00,378.00,87.00,-364.00,14
82,-1,438.00,503.00,95.00,-488.00,15
82,-1,466.00,370.00,88.00,-356.00,14
83,-1,433.00,502.00,112.00,-487.00,15
83,-1,473.00,360.00,91.00,-346.00,14
84,-1,433.00,504.00,122.00,-489.00,15
84,-1,480.00,349.00,93.00,-335.00,14
85,-1,439.00,504.00,127.00,-489.00,15
85,-1,488.00,337.00,93.00,-323.00,14
86,-1,447.00,504.00,125.00,-489.00,15
86,-1,495.00,329.00,98.00,-315.00,14
87,-1,454.00,500.00,133.00,-485.00,15
87,-1,500.00,318.00,109.00,-304.00,14
88,-1,460.00,500.00,138.00,-485.00,15
88,-1,510.00,311.00,113.00,-297.00,14
89,-1,469.00,494.00,147.00,-479.00,15
89,-1,518.00,299.00,120.00,-285.00,14
90,-1,479.00,490.00,148.00,-475.00,15
90,-1,530.00,288.00,121.00,-274.00,14
91,-1,486.00,488.00,159.00,-473.00,15
91,-1,540.00,276.00,117.00,-262.00,14
92,-1,399.00,503.00,63.00,-485.00,18
92,-1,498.00,481.00,157.00,-466.00,15
92,-1,551.00,262.00,104.00,-248.00,14
93,-1,399.00,504.00,71.00,-486.00,18
93,-1,509.00,477.00,152.00,-462.00,15
94,-1,401.00,504.00,75.00,-486.00,18
94,-1,520.00,469.00,143.00,-454.00,15
95,-1,399.00,504.00,83.00,-486.00,18
95,-1,533.00,459.00,131.00,-444.00,15
96,-1,402.00,503.00,87.00,-485.00,18
96,-1,543.00,448.00,119.00,-433.00,15
97,-1,402.00,503.00,94.00,-485.00,18
97,-1,558.00,437.00,104.00,-422.00,15
98,-1,406.00,503.00,99.00,-485.00,18
99,-1,414.00,504.00,95.00,-486.00,18
100,-1,407.00,504.00,111.00,-486.00,18
101,-1,404.00,503.00,122.00,-485.00,18
102,-1,409.00,503.00,125.00,-485.00,18
103,-1,413.00,504.00,131.00,-486.00,18
104,-1,417.00,504.00,138.00,-486.00,18
105,-1,423.00,504.00,149.00,-486.00,18
106,-1,430.00,504.00,152.00,-486.00,18
107,-1,438.00,503.00,152.00,-485.00,18
108,-1,444.00,500.00,164.00,-482.00,18
109,-1,449.00,498.00,181.00,-480.00,18
110,-1,458.00,490.00,181.00,-472.00,18
111,-1,464.00,487.00,186.00,-469.00,18
112,-1,474.00,469.00,182.00,-451.00,18
113,-1,491.00,469.00,166.00,-451.00,18
114,-1,500.00,465.00,156.00,-447.00,18
115,-1,502.00,455.00,159.00,-437.00,18
116,-1,514.00,442.00,148.00,-424.00,18
120,-1,411.00,503.00,73.00,-482.00,21
121,-1,414.00,503.00,74.00,-482.00,21
122,-1,423.00,504.00,71.00,-483.00,21
123,-1,427.00,505.00,73.00,-484.00,21
124,-1,432.00,504.00,76.00,-483.00,21
125,-1,438.00,503.00,78.00,-482.00,21
126,-1,443.00,501.00,81.00,-480.00,21
127,-1,448.00,497.00,82.00,-476.00,21
128,-1,455.00,492.00,85.00,-471.00,21
129,-1,459.00,490.00,94.00,-469.00,21
130,-1,463.00,486.00,103.00,-465.00,21
131,-1,474.00,481.00,102.00,-460.00,21
132,-1,482.00,475.00,105.00,-454.00,21
133,-1,490.00,470.00,111.00,-449.00,21
134,-1,500.00,461.00,114.00,-440.00,21
135,-1,510.00,453.00,120.00,-432.00,21
136,-1,520.00,444.00,128.00,-423.00,21
137,-1,532.00,436.00,125.00,-415.00,21
138,-1,540.00,432.00,122.00,-411.00,21
139,-1,544.00,417.00,119.00,-396.00,21
140,-1,543.00,413.00,120.00,-392.00,21
141,-1,577.00,405.00,84.00,-384.00,21
142,-1,597.00,392.00,65.00,-371.00,21
143,-1,619.00,377.00,43.00,-356.00,21
151,-1,398.00,463.00,50.00,-441.00,22
152,-1,399.00,457.00,50.00,-435.00,22
153,-1,399.00,454.00,56.00,-432.00,22
154,-1,400.00,449.00,59.00,-427.00,22
155,-1,403.00,448.00,62.00,-426.00,22
156,-1,403.00,447.00,68.00,-425.00,22
