{
	"info": {
		"_postman_id": "8140e83a-5736-4bd0-8f6a-f6071f69f630",
		"name": "Batch127_Capstone-2",
		"schema": "https://schema.getpostman.com/json/collection/v2.1.0/collection.json"
	},
	"item": [
		{
			"name": "Users",
			"item": [
				{
					"name": "Check DUPLICATE email",
					"request": {
						"method": "POST",
						"header": [],
						"body": {
							"mode": "raw",
							"raw": "{\r\n    \"email\": \"johndoe@mail.com\"\r\n}",
							"options": {
								"raw": {
									"language": "json"
								}
							}
						},
						"url": {
							"raw": "https://rocky-spire-44691.herokuapp.com/users/checkEmail",
							"protocol": "https",
							"host": [
								"rocky-spire-44691",
								"herokuapp",
								"com"
							],
							"path": [
								"users",
								"checkEmail"
							]
						}
					},
					"response": []
				},
				{
					"name": "Check DUPLICATE username",
					"request": {
						"method": "POST",
						"header": [],
						"body": {
							"mode": "raw",
							"raw": "{\r\n    \"userName\": \"johndoe\"\r\n}",
							"options": {
								"raw": {
									"language": "json"
								}
							}
						},
						"url": {
							"raw": "https://rocky-spire-44691.herokuapp.com/users/checkUsername",
							"protocol": "https",
							"host": [
								"rocky-spire-44691",
								"herokuapp",
								"com"
							],
							"path": [
								"users",
								"checkUsername"
							]
						}
					},
					"response": []
				},
				{
					"name": "REGISTER a user",
					"request": {
						"method": "POST",
						"header": [],
						"body": {
							"mode": "raw",
							"raw": "{\r\n\t\"firstName\": \"John\",\r\n\t\"lastName\": \"Doe\",\r\n\t\"address\": \"Manila\",\r\n\t\"mobileNo\": \"09123456789\",\r\n\t\"email\": \"johndoe@mail.com\",\r\n\t\"userName\": \"johndoe\",\r\n\t\"password\": \"johndoe123\"\r\n}",
							"options": {
								"raw": {
									"language": "json"
								}
							}
						},
						"url": {
							"raw": "https://rocky-spire-44691.herokuapp.com/users/register",
							"protocol": "https",
							"host": [
								"rocky-spire-44691",
								"herokuapp",
								"com"
							],
							"path": [
								"users",
								"register"
							]
						}
					},
					"response": []
				},
				{
					"name": "LOGIN a user",
					"request": {
						"method": "POST",
						"header": [],
						"body": {
							"mode": "raw",
							"raw": "{\r\n\t\"userName\": \"johndoe\",\r\n\t\"password\": \"johndoe123\"\r\n}",
							"options": {
								"raw": {
									"language": "json"
								}
							}
						},
						"url": {
							"raw": "https://rocky-spire-44691.herokuapp.com/users/login",
							"protocol": "https",
							"host": [
								"rocky-spire-44691",
								"herokuapp",
								"com"
							],
							"path": [
								"users",
								"login"
							]
						}
					},
					"response": []
				},
				{
					"name": "GET user details (ADMIN)",
					"request": {
						"auth": {
							"type": "bearer",
							"bearer": [
								{
									"key": "token",
									"value": "eyJhbGciOiJIUzI1NiIsInR5cCI6IkpXVCJ9.eyJpZCI6IjYxNWMwYzE0NmY1Y2FlZDJiNmViMTA5NyIsImVtYWlsIjoiam9obmRvZUBtYWlsLmNvbSIsImlzQWRtaW4iOnRydWUsImlhdCI6MTYzMzQyMjY3Nn0.idMF6fP_2ybH76VOuFvC0c9agOs9L0Bc_LszpOjo7pg",
									"type": "string"
								}
							]
						},
						"method": "GET",
						"header": [],
						"url": {
							"raw": "https://rocky-spire-44691.herokuapp.com/users/details",
							"protocol": "https",
							"host": [
								"rocky-spire-44691",
								"herokuapp",
								"com"
							],
							"path": [
								"users",
								"details"
							]
						}
					},
					"response": []
				},
				{
					"name": "set USER as ADMIN",
					"request": {
						"auth": {
							"type": "bearer",
							"bearer": [
								{
									"key": "token",
									"value": "eyJhbGciOiJIUzI1NiIsInR5cCI6IkpXVCJ9.eyJpZCI6IjYxNWMwYzE0NmY1Y2FlZDJiNmViMTA5NyIsImVtYWlsIjoiam9obmRvZUBtYWlsLmNvbSIsImlzQWRtaW4iOnRydWUsImlhdCI6MTYzMzQyMjY3Nn0.idMF6fP_2ybH76VOuFvC0c9agOs9L0Bc_LszpOjo7pg",
									"type": "string"
								}
							]
						},
						"method": "PUT",
						"header": [],
						"url": {
							"raw": "https://rocky-spire-44691.herokuapp.com/users/setAsAdmin/615c0c146f5caed2b6eb1097",
							"protocol": "https",
							"host": [
								"rocky-spire-44691",
								"herokuapp",
								"com"
							],
							"path": [
								"users",
								"setAsAdmin",
								"615c0c146f5caed2b6eb1097"
							]
						}
					},
					"response": []
				},
				{
					"name": "CREATE order",
					"request": {
						"auth": {
							"type": "bearer",
							"bearer": [
								{
									"key": "token",
									"value": "eyJhbGciOiJIUzI1NiIsInR5cCI6IkpXVCJ9.eyJpZCI6IjYxNWMwYzE0NmY1Y2FlZDJiNmViMTA5NyIsImVtYWlsIjoiam9obmRvZUBtYWlsLmNvbSIsImlzQWRtaW4iOnRydWUsImlhdCI6MTYzMzQyMjg4MX0.xsdEg2S-GB8vERRNXfc2wbfuU1mJTaQIypoAJaaMZwI",
									"type": "string"
								}
							]
						},
						"method": "POST",
						"header": [],
						"body": {
							"mode": "raw",
							"raw": "{\r\n    \"productId\":\"615c0f146cc9d53a8501ca0c\"\r\n}",
							"options": {
								"raw": {
									"language": "json"
								}
							}
						},
						"url": {
							"raw": "https://rocky-spire-44691.herokuapp.com/users/cart/",
							"protocol": "https",
							"host": [
								"rocky-spire-44691",
								"herokuapp",
								"com"
							],
							"path": [
								"users",
								"cart",
								""
							]
						}
					},
					"response": []
				},
				{
					"name": "GET ALL orders",
					"protocolProfileBehavior": {
						"disableBodyPruning": true
					},
					"request": {
						"auth": {
							"type": "bearer",
							"bearer": [
								{
									"key": "token",
									"value": "eyJhbGciOiJIUzI1NiIsInR5cCI6IkpXVCJ9.eyJpZCI6IjYxNTQ2YmQxNmM4OTllYmEyYjUzNmE2ZCIsImVtYWlsIjoidGF5Z29tZXpAbWFpbC5jb20iLCJpc0FkbWluIjpmYWxzZSwiaWF0IjoxNjMzNDE0MTQ5fQ.uPiHNBMJGG78DByv0STKhsw0xiRFQzWWg6gWdund4Xc",
									"type": "string"
								}
							]
						},
						"method": "GET",
						"header": [],
						"body": {
							"mode": "raw",
							"raw": "{\r\n    \"productId\": \"6154b0f088a9eb2ce3032453\"\r\n\r\n}",
							"options": {
								"raw": {
									"language": "json"
								}
							}
						},
						"url": {
							"raw": "https://rocky-spire-44691.herokuapp.com/users/cart",
							"protocol": "https",
							"host": [
								"rocky-spire-44691",
								"herokuapp",
								"com"
							],
							"path": [
								"users",
								"cart"
							]
						}
					},
					"response": []
				},
				{
					"name": "GET ALL user's orders (ADMIN)",
					"request": {
						"auth": {
							"type": "bearer",
							"bearer": [
								{
									"key": "token",
									"value": "eyJhbGciOiJIUzI1NiIsInR5cCI6IkpXVCJ9.eyJpZCI6IjYxNWMwYzE0NmY1Y2FlZDJiNmViMTA5NyIsImVtYWlsIjoiam9obmRvZUBtYWlsLmNvbSIsImlzQWRtaW4iOnRydWUsImlhdCI6MTYzMzQyMjg4MX0.xsdEg2S-GB8vERRNXfc2wbfuU1mJTaQIypoAJaaMZwI",
									"type": "string"
								}
							]
						},
						"method": "GET",
						"header": [],
						"url": {
							"raw": "https://rocky-spire-44691.herokuapp.com/users/orders",
							"protocol": "https",
							"host": [
								"rocky-spire-44691",
								"herokuapp",
								"com"
							],
							"path": [
								"users",
								"orders"
							]
						}
					},
					"response": []
				}
			]
		},
		{
			"name": "Products",
			"item": [
				{
					"name": "CREATE a product (ADMIN)",
					"request": {
						"auth": {
							"type": "bearer",
							"bearer": [
								{
									"key": "token",
									"value": "eyJhbGciOiJIUzI1NiIsInR5cCI6IkpXVCJ9.eyJpZCI6IjYxNWMwYzE0NmY1Y2FlZDJiNmViMTA5NyIsImVtYWlsIjoiam9obmRvZUBtYWlsLmNvbSIsImlzQWRtaW4iOnRydWUsImlhdCI6MTYzMzQyMjg4MX0.xsdEg2S-GB8vERRNXfc2wbfuU1mJTaQIypoAJaaMZwI",
									"type": "string"
								}
							]
						},
						"method": "POST",
						"header": [],
						"body": {
							"mode": "raw",
							"raw": "{\t\r\n\t\"brandName\": \"Red Velvet\",\r\n\t\"productName\": \"The ReVe Festival: Finale\",\r\n\t\"category\": \"Music\",\r\n\t\"description\": \"The ReVe Festival: Finale is the first Korean-language compilation album by South Korean girl group Red Velvet. As the third and final release of the group's trilogy The ReVe Festival, the set contains all twelve tracks taken from two previous extended plays The ReVe Festival: Day 1 and The ReVe Festival: Day 2.\",\r\n\t\"price\": 1200\r\n}",
							"options": {
								"raw": {
									"language": "json"
								}
							}
						},
						"url": {
							"raw": "https://rocky-spire-44691.herokuapp.com/products/",
							"protocol": "https",
							"host": [
								"rocky-spire-44691",
								"herokuapp",
								"com"
							],
							"path": [
								"products",
								""
							]
						}
					},
					"response": []
				},
				{
					"name": "GET ALL products",
					"request": {
						"method": "GET",
						"header": [],
						"url": {
							"raw": "https://rocky-spire-44691.herokuapp.com/products/all",
							"protocol": "https",
							"host": [
								"rocky-spire-44691",
								"herokuapp",
								"com"
							],
							"path": [
								"products",
								"all"
							]
						}
					},
					"response": []
				},
				{
					"name": "GET all ACTIVE products",
					"request": {
						"method": "GET",
						"header": [],
						"url": {
							"raw": "https://rocky-spire-44691.herokuapp.com/products",
							"protocol": "https",
							"host": [
								"rocky-spire-44691",
								"herokuapp",
								"com"
							],
							"path": [
								"products"
							]
						}
					},
					"response": []
				},
				{
					"name": "GET a SPECIFIC product",
					"request": {
						"method": "GET",
						"header": [],
						"url": {
							"raw": "https://rocky-spire-44691.herokuapp.com/products/6155a0bd7b9badf73444a1c4",
							"protocol": "https",
							"host": [
								"rocky-spire-44691",
								"herokuapp",
								"com"
							],
							"path": [
								"products",
								"6155a0bd7b9badf73444a1c4"
							]
						}
					},
					"response": []
				},
				{
					"name": "UPDATE a product information (ADMIN)",
					"request": {
						"auth": {
							"type": "bearer",
							"bearer": [
								{
									"key": "token",
									"value": "eyJhbGciOiJIUzI1NiIsInR5cCI6IkpXVCJ9.eyJpZCI6IjYxNTQ2OTlhNmM4OTllYmEyYjUzNmE2NSIsImVtYWlsIjoiam9obmRvZUBtYWlsLmNvbSIsImlzQWRtaW4iOnRydWUsImlhdCI6MTYzMzAwMjQ1M30.jCZ9FlYfNj_ESh8UoBkZ1ElRwiohMW3FXo3QH-tnNTM",
									"type": "string"
								}
							]
						},
						"method": "PUT",
						"header": [],
						"body": {
							"mode": "raw",
							"raw": "{\t\r\n\t\"description\": \"THE ALBUM is the first Korean studio album (second overall) by South Korean girl group Blackpink. It was released on October 2, 2020 through YG Entertainment and Interscope Records.\",\r\n\t\"price\": 1200\r\n}",
							"options": {
								"raw": {
									"language": "json"
								}
							}
						},
						"url": {
							"raw": "https://rocky-spire-44691.herokuapp.com/products/6155a0bd7b9badf73444a1c4",
							"protocol": "https",
							"host": [
								"rocky-spire-44691",
								"herokuapp",
								"com"
							],
							"path": [
								"products",
								"6155a0bd7b9badf73444a1c4"
							]
						}
					},
					"response": []
				},
				{
					"name": "ARCHIVE a product (ADMIN)",
					"request": {
						"auth": {
							"type": "bearer",
							"bearer": [
								{
									"key": "token",
									"value": "eyJhbGciOiJIUzI1NiIsInR5cCI6IkpXVCJ9.eyJpZCI6IjYxNTQ2OTlhNmM4OTllYmEyYjUzNmE2NSIsImVtYWlsIjoiam9obmRvZUBtYWlsLmNvbSIsImlzQWRtaW4iOnRydWUsImlhdCI6MTYzMzAwMjQ1M30.jCZ9FlYfNj_ESh8UoBkZ1ElRwiohMW3FXo3QH-tnNTM",
									"type": "string"
								}
							]
						},
						"method": "PUT",
						"header": [],
						"url": {
							"raw": "https://rocky-spire-44691.herokuapp.com/products/archive/6155a0bd7b9badf73444a1c4",
							"protocol": "https",
							"host": [
								"rocky-spire-44691",
								"herokuapp",
								"com"
							],
							"path": [
								"products",
								"archive",
								"6155a0bd7b9badf73444a1c4"
							]
						}
					},
					"response": []
				}
			]
		},
		{
			"name": "Orders",
			"item": []
		}
	]
}