Place,Name,Country,Division,Equipment,Event,BirthDate,BirthYear,Sex,BodyweightKg,WeightClassKg,Squat1Kg,Squat2Kg,Squat3Kg,Best3SquatKg,Bench1Kg,Bench2Kg,Bench3Kg,Best3BenchKg,Deadlift1Kg,Deadlift2Kg,Deadlift3Kg,Best3DeadliftKg,TotalKg
1,Gauthier Petit,,Sub-Juniors,Raw,SBD,,2004,M,81.73,83,175,190,200,200,110,117.5,122.5,122.5,195,215,220,220,542.5
1,Alexandre Labesse,,Juniors,Raw,SBD,,2001,M,58.8,59,-167.5,167.5,-175,167.5,100,105,-107.5,105,170,180,-187.5,180,452.5
1,Dorian Prevost,,Juniors,Raw,SBD,,1999,M,72.19,74,165,172.5,177.5,177.5,105,110,-112.5,110,205,-212.5,215,215,502.5
1,Mortada Mohan Saad,,Juniors,Raw,SBD,,2002,M,75.68,83,165,172.5,177.5,177.5,-130,135,137.5,137.5,195,-205,205,205,520
2,Thomas Paties,,Juniors,Raw,SBD,,2000,M,80.89,83,150,157.5,-162.5,157.5,90,-95,95,95,195,202.5,-210,202.5,455
3,Luckson Au,,Juniors,Raw,SBD,,2002,M,83,83,120,135,145,145,95,102.5,-110,102.5,135,152.5,162.5,162.5,410
4,Raphaël Zimmer,,Juniors,Raw,SBD,,2000,M,80.27,83,105,115,125,125,70,80,-85,80,160,170,180,180,385
1,Hugo Dumont,,Juniors,Raw,SBD,,2000,M,86.56,93,190,200,205,205,130,135,-140,135,250,260,-270,260,600
2,Enzo Delmaestro,,Juniors,Raw,SBD,,2000,M,92.57,93,182.5,192.5,200,200,92.5,100,-105,100,185,195,-200,195,495
3,Tristan Lamoureux,,Juniors,Raw,SBD,,2000,M,85.33,93,165,172.5,180,180,87.5,90,92.5,92.5,195,205,215,215,487.5
1,Charles Sanseverino,,Seniors,Raw,SBD,,1995,M,62.79,66,137.5,145,150,150,90,-95,-95,90,175,180,-187.5,180,420
1,Yohann Victor,,Seniors,Raw,SBD,,1998,M,72.41,74,165,180,-190,180,95,100,-105,100,200,220,-222.5,220,500
2,Anthony Vivier,,Seniors,Raw,SBD,,1997,M,72.33,74,160,170,180,180,-120,125,130,130,175,187.5,-200,187.5,497.5
1,Thierry Richa,,Seniors,Raw,SBD,,1987,M,76.01,83,210,220,-225,220,135,140,-145,140,230,245,-255,245,605
2,Théo Benard,,Seniors,Raw,SBD,,1998,M,81.27,83,175,190,197.5,197.5,120,127.5,-135,127.5,230,240,-250,240,565
3,Florent Torre,,Seniors,Raw,SBD,,1995,M,78.27,83,167.5,172.5,177.5,177.5,127.5,132.5,137.5,137.5,200,207.5,-215,207.5,522.5
4,Pierre Lamoureux,,Seniors,Raw,SBD,,1996,M,81.95,83,175,185,-190,185,-102.5,-102.5,102.5,102.5,220,230,235,235,522.5
5,Emmanuel Breton,,Seniors,Raw,SBD,,1985,M,80.2,83,150,165,175,175,105,-110,110,110,190,200,212.5,212.5,497.5
1,Paul Lanciano,,Seniors,Raw,SBD,,1994,M,92.66,93,220,230,235,235,147.5,-152.5,-152.5,147.5,240,250,-255,250,632.5
1,Bérenger Vicaine,,Seniors,Raw,SBD,,1994,M,104.17,105,235,247.5,-255,247.5,167.5,175,-180,175,262.5,277.5,292.5,292.5,715
1,Jacques-Alexandre Perrault,,Juniors,Raw,SBD,,2002,M,68.99,74,185,192.5,200,200,105,110,-115,110,195,200,-205,200,510
1,Barnabé Lutz,,Juniors,Raw,SBD,,2001,M,65.8,66,160,-170,-170,160,-115,115,120,120,190,200,210,210,490
1,Ludwig Thiebaut,,Seniors,Raw,SBD,,1996,M,96.74,105,175,-187.5,-187.5,175,115,120,122.5,122.5,215,230,237.5,237.5,535
1,Mathis Lucchese Taconnat,,Juniors,Raw,SBD,,1999,M,100.85,105,197.5,210,217.5,217.5,120,125,127.5,127.5,227.5,242.5,250,250,595
1,Sami Chaabani,,Juniors,Raw,SBD,,2003,M,103.52,105,235,245,260,260,142.5,150,-155,150,240,255,-265,255,665
1,Pierre Mathoulin,,Seniors,Raw,SBD,,1998,M,93.01,105,192.5,-200,200,200,130,-135,-135,130,245,255,-265,255,585
1,Matthew Hobeiche,,Seniors,Raw,SBD,,1994,M,107.29,120,235,-245,245,245,115,120,-125,120,260,270,275,275,640
1,Logan Mendez,,Juniors,Raw,SBD,,2001,M,91.45,93,207.5,-217.5,-217.5,207.5,145,-152.5,152.5,152.5,205,-215,215,215,575
1,Raphaël Renaud,,Juniors,Raw,SBD,,1999,M,81.31,83,175,182.5,190,190,117.5,122.5,125,125,210,217.5,222.5,222.5,537.5
1,Théo Durand,,Seniors,Raw,SBD,,1998,M,81.31,83,210,220,230,230,120,130,-135,130,220,-230,240,240,600
1,Luca Stephan,,Seniors,Raw,SBD,,1997,M,89.4,93,177.5,185,192.5,192.5,125,132.5,-140,132.5,217.5,232.5,-242.5,232.5,557.5
1,Adrien Beysson,,Juniors,Raw,SBD,,1999,M,77.83,83,155,-165,165,165,102.5,107.5,-112.5,107.5,220,235,-242.5,235,507.5
1,Flavien Paillet,,Seniors,Raw,SBD,,1994,M,74.62,83,145,155,162.5,162.5,105,110,115,115,160,170,180,180,457.5
1,Achille La Loggia,,Sub-Juniors,Raw,SBD,,2004,M,88.26,93,125,135,145,145,85,92.5,-95,92.5,155,170,180,180,417.5
1,Nathan Julien,,Juniors,Raw,SBD,,2003,M,86.88,93,-185,200,-210,200,117.5,125,-130,125,205,210,-215,210,535
1,Jean-Etienne Doazan,,Seniors,Raw,SBD,,1997,M,108.62,120,200,210,215,215,140,150,157.5,157.5,210,220,227.5,227.5,600
1,Luca Stassiouk,,Seniors,Raw,SBD,,1996,M,92.4,93,185,190,195,195,112.5,117.5,-122.5,117.5,215,222.5,-230,222.5,535
1,Matteo Fiasconaro,,Seniors,Raw,SBD,,1995,M,82.26,83,180,190,-197.5,190,135,-142.5,142.5,142.5,210,222.5,230,230,562.5
1,Romain De Jesus,,Seniors,Raw,SBD,,1988,M,73.11,74,190,-200,200,200,150,157.5,160,160,210,222.5,-235,222.5,582.5
1,Matthieu De Palma,,Juniors,Raw,SBD,,2000,M,95.5,105,200,210,-215,210,115,-122.5,122.5,122.5,225,-240,240,240,572.5
1,Christophe Barbosa,,Masters 1,Raw,SBD,,1975,M,103.5,105,215,222.5,-230,222.5,135,140,145,145,220,230,-240,230,597.5
1,Simon Brienne,,Seniors,Raw,SBD,,1998,M,93,93,230,242.5,-247.5,242.5,135,140,-142.5,140,250,262.5,270,270,652.5
1,Pierre Espinasse,,Juniors,Raw,SBD,,2003,M,81.16,83,135,145,150,150,85,90,-95,90,165,175,185,185,425
1,Tom Pennors,,Juniors,Raw,SBD,,1999,M,73.74,74,-140,-142.5,142.5,142.5,80,87.5,-90,87.5,185,192.5,-200,192.5,422.5
1,Emrick Maurelet,,Juniors,Raw,SBD,,1999,M,64.94,66,172.5,182.5,185,185,112.5,117.5,-122.5,117.5,200,212.5,217.5,217.5,520
1,Arnaud Taupin,,Seniors,Raw,SBD,,1986,M,73.18,74,195,207.5,215,215,140,145,147.5,147.5,235,247.5,255,255,617.5
1,Emma Castelot,,Juniors,Raw,SBD,,2000,F,59.59,63,95,100,102.5,102.5,65,67.5,-70,67.5,135,-140,140,140,310
1,Alba Ordóñez Rodríguez,,Seniors,Raw,SBD,,1998,F,56.05,57,112.5,120,-125,120,62.5,-67.5,-67.5,62.5,127.5,135,140,140,322.5
1,Yahel Daudon,,Juniors,Raw,SBD,,1999,F,56.76,57,127.5,135,-140,135,57.5,62.5,65,65,140,150,-160,150,350
1,Julie Mignon,,Seniors,Raw,SBD,,1998,F,57.3,63,82.5,-90,90,90,55,-57.5,-60,55,107.5,115,-120,115,260
1,Julie Hilaire,,Seniors,Raw,SBD,,1993,F,56.6,57,95,100,105,105,45,50,-52.5,50,120,130,135,135,290
1,Léa Lambert #1,,Juniors,Raw,SBD,,2000,F,58.9,63,100,105,110,110,57.5,60,62.5,62.5,125,132.5,140,140,312.5
1,Cécile Caux,,Seniors,Raw,SBD,,1992,F,75.44,76,117.5,125,-132.5,125,55,57.5,-60,57.5,152.5,160,165,165,347.5
1,Sacha Turpin,,Seniors,Raw,SBD,,1996,M,72.13,74,167.5,175,182.5,182.5,107.5,112.5,117.5,117.5,-212.5,212.5,220,220,520
1,Antoine Metois,,Juniors,Raw,SBD,,2000,M,78.83,83,190,200,205,205,132.5,-140,-140,132.5,200,210,220,220,557.5
1,Sarah Collery,,Seniors,Raw,SBD,,1998,F,62.99,63,105,-110,-110,105,55,60,62.5,62.5,110,117.5,125,125,292.5
1,Lucien Lorgeau,,Juniors,Raw,SBD,,2001,M,73.95,74,185,192.5,197.5,197.5,122.5,127.5,-130,127.5,205,217.5,227.5,227.5,552.5
1,Leah De Sa,,Juniors,Raw,SBD,,2001,F,66.39,69,102.5,110,117.5,117.5,70,75,-80,75,135,147.5,-157.5,147.5,340
1,Lucille Gerhardt,,Seniors,Raw,SBD,,1994,F,67.8,69,110,117.5,125,125,70,72.5,-75,72.5,142.5,152.5,-160,152.5,350
1,Fanny Pasek,,Juniors,Raw,SBD,,2001,F,61.15,63,100,105,-107.5,105,50,-55,-55,50,120,127.5,-135,127.5,282.5
