Division,WeightClassKg,Place,Name,Team,BodyweightKg,Best3SquatKg,Best3BenchKg,Best3DeadliftKg,TotalKg,Equipment,Event,Sex
Boys,51.71,1,Toni Ogunsola,Frisco,51.44,183.7,90.72,185.97,460.4,Single-ply,SBD,M
Boys,51.71,2,George Bankhead,Freeport Brazosport,51.53,163.29,92.99,199.58,455.86,Single-ply,SBD,M
Boys,51.71,3,JT White,Cedar Hill,51.62,170.1,81.65,201.85,453.59,Single-ply,SBD,M
Boys,51.71,4,Jesse Corez,Pharr Valley View,50.71,163.29,92.99,183.7,439.98,Single-ply,SBD,M
Boys,51.71,5,Juan Chapa,San Antonio Southside,51.62,163.29,106.59,165.56,435.45,Single-ply,SBD,M
Boys,51.71,6,Hector Villegas,Roma,50.89,165.56,81.65,172.37,419.57,Single-ply,SBD,M
Boys,51.71,7,Randy Trevino,Gregory-Portland,50.26,161.03,83.91,167.83,412.77,Single-ply,SBD,M
Boys,51.71,8,Justin Davis,Buda Hays,50.71,145.15,102.06,161.03,408.23,Single-ply,SBD,M
Boys,51.71,9,Angel Flores #2,Weslaco East,51.35,151.95,86.18,165.56,403.7,Single-ply,SBD,M
Boys,55.79,10,Blake Alford,Kyle Lehman,51.94,149.69,72.57,167.83,390.09,Single-ply,SBD,M
Boys,51.71,11,Jesse Ortiz,Sulphur Springs,51.17,149.69,79.38,151.95,381.02,Single-ply,SBD,M
Boys,51.71,12,Carlos Raya,Plainview,51.62,129.27,97.52,147.42,374.21,Single-ply,SBD,M
Boys,55.79,13,Cecilio Hernandez,Dickinson,51.94,124.74,81.65,149.69,356.07,Single-ply,SBD,M
Boys,55.79,14,Anthony Washington,Plainview,51.89,136.08,68.04,149.69,353.8,Single-ply,SBD,M
Boys,51.71,15,Colton Doyal,Waxahachie,50.89,108.86,63.5,129.27,301.64,Single-ply,SBD,M
Boys,51.71,DQ,David Garcia #5,Pharr Valley View,51.07,136.08,,,,Single-ply,SBD,M
Boys,51.71,DQ,Rodney Barnes,Everman,50.17,165.56,81.65,,,Single-ply,SBD,M
Boys,55.79,1,Thomas Soto,Corpus Christi Calallen,54.61,210.92,108.86,219.99,539.77,Single-ply,SBD,M
Boys,55.79,2,Thomas Mascorro,San Marcos,54.07,185.97,129.27,204.12,519.36,Single-ply,SBD,M
Boys,55.79,3,Shirmar Jennings,Plainview,54.07,208.65,115.67,192.78,517.1,Single-ply,SBD,M
Boys,55.79,4,Omar Puente,Los Fresnos,55.52,192.78,127.01,197.31,517.1,Single-ply,SBD,M
Boys,55.79,5,Armani Donaldson,Wichita Falls,55.43,181.44,108.86,188.24,478.54,Single-ply,SBD,M
Boys,59.87,6,Dominique Moreland,Mansfield Summit,56.02,185.97,95.25,197.31,478.54,Single-ply,SBD,M
Boys,55.79,7,Edgar Barbosa,Laredo Cigarroa,55.25,172.37,108.86,190.51,471.74,Single-ply,SBD,M
Boys,55.79,8,Marcus Hernandez #1,Victoria West,55.16,183.7,81.65,201.85,467.2,Single-ply,SBD,M
Boys,55.79,9,Luis Vasquez,Los Fresnos,55.16,172.37,102.06,188.24,462.66,Single-ply,SBD,M
Boys,55.79,10,Jeremy Charles,Willis,55.43,181.44,113.4,167.83,462.66,Single-ply,SBD,M
Boys,55.79,11,Mauro Garcia,Port Lavaca Calhoun,55.7,174.63,97.52,185.97,458.13,Single-ply,SBD,M
Boys,55.79,12,Jesse Ramirez #2,San Angelo Lake View,55.34,167.83,106.59,181.44,455.86,Single-ply,SBD,M
Boys,59.87,13,Ashton Williams,Everman,56.02,165.56,90.72,197.31,453.59,Single-ply,SBD,M
Boys,59.87,14,Jamahl Johnson,Houston Cypress Woods,56.02,172.37,88.45,190.51,451.32,Single-ply,SBD,M
Boys,59.87,15,Jacob de la Paz,Corpus Christi Calallen,55.97,179.17,79.38,181.44,439.98,Single-ply,SBD,M
Boys,55.79,16,Raul Mata,San Benito,55.34,161.03,102.06,156.49,419.57,Single-ply,SBD,M
Boys,59.87,DQ,Kamary Wiley,Wichita Falls,55.97,,,,,Single-ply,SBD,M
Boys,55.79,DQ,Joseph Rico,Forney,55.34,133.81,86.18,,,Single-ply,SBD,M
Boys,59.87,DQ,Camron King,Marshall,55.88,,,,,Single-ply,SBD,M
Boys,55.79,DQ,Marquis Wilson,Elgin,55.7,138.35,95.25,,,Single-ply,SBD,M
Boys,59.87,1,Jerry Alaniz,Laredo Alexander,58.88,235.87,136.08,185.97,557.92,Single-ply,SBD,M
Boys,59.87,2,Kenny Nguyen,Dickinson,58.79,208.65,163.29,183.7,555.65,Single-ply,SBD,M
Boys,59.87,3,Aaron Robles,San Benito,59.51,188.24,124.74,213.19,526.17,Single-ply,SBD,M
Boys,67.13,4,Michael Robason,Frisco Wakeland,59.96,226.8,97.52,190.51,514.83,Single-ply,SBD,M
Boys,59.87,5,Jarrett Burford,Dripping Springs,59.51,199.58,124.74,188.24,512.56,Single-ply,SBD,M
Boys,59.87,6,Juan Torres #1,San Benito,58.79,183.7,102.06,201.85,487.61,Single-ply,SBD,M
Boys,59.87,7,Tevin Cofield,Mansfield,59.51,181.44,106.59,195.04,483.08,Single-ply,SBD,M
Boys,67.13,8,Ta'Montre Mitchell,Greenville,59.96,188.24,99.79,165.56,453.59,Single-ply,SBD,M
Boys,67.13,9,Josh Binder,Midland,59.96,154.22,97.52,176.9,428.64,Single-ply,SBD,M
Boys,59.87,DQ,DeMarco Corner,Manvel,59.15,,,,,Single-ply,SBD,M
Boys,59.87,DQ,Ja'Vontay Williams,Nacogdoches,59.78,172.37,81.65,,,Single-ply,SBD,M
Boys,59.87,DQ,Jeremy Reyes,Odessa,59.06,,,,,Single-ply,SBD,M
Boys,59.87,DQ,Josh Fantauzzi,Buda Hays,58.79,197.31,104.33,,,Single-ply,SBD,M
Boys,67.13,1,David Lopez #7,Laredo United South,65.68,206.38,147.42,219.99,573.79,Single-ply,SBD,M
Boys,67.13,2,Thomas Garcia,Midland,65.95,217.72,140.61,215.46,573.79,Single-ply,SBD,M
Boys,67.13,3,Cesar Alfaro,Laredo United South,66.68,206.38,136.08,215.46,557.92,Single-ply,SBD,M
Boys,74.84,4,Jamal Simms,Houston Madison,67.36,213.19,124.74,213.19,551.11,Single-ply,SBD,M
Boys,67.13,5,David Ledbetter,Victoria West,66.32,206.38,136.08,206.38,548.85,Single-ply,SBD,M
Boys,67.13,6,Matthew Barrett,Mansfield Summit,65.23,217.72,104.33,224.53,546.58,Single-ply,SBD,M
Boys,74.84,7,Reggie Davis,College Station A&M Cons,67.31,199.58,140.61,204.12,544.31,Single-ply,SBD,M
Boys,67.13,8,Kenneth Stafford,Everman,66.22,208.65,122.47,208.65,539.77,Single-ply,SBD,M
Boys,67.13,9,Connor Cross,Dripping Springs,66.95,231.33,108.86,199.58,539.77,Single-ply,SBD,M
Boys,67.13,10,Essix Lightfoot,Everman,67.04,215.46,117.93,201.85,535.24,Single-ply,SBD,M
Boys,67.13,11,Ritchie Lyttle,New Caney Porter,66.77,213.19,117.93,195.04,526.17,Single-ply,SBD,M
Boys,67.13,12,Josh Goolsby,Huntsville,66.32,170.1,111.13,217.72,498.95,Single-ply,SBD,M
Boys,67.13,13,Tommie Martinez,Midlothian,65.86,192.78,115.67,181.44,489.88,Single-ply,SBD,M
Boys,67.13,DQ,Steven McCartha,Montgomery,66.22,,,,,Single-ply,SBD,M
Boys,67.13,DQ,Ivan Arroyo,Odessa,63.41,181.44,,,,Single-ply,SBD,M
Boys,74.84,DQ,Pat White,Lewisville The Colony,67.36,,,,,Single-ply,SBD,M
Boys,67.13,DQ,Aaron Pomerantz,Lewisville Marcus,65.86,,,,,Single-ply,SBD,M
Boys,74.84,1,John Wrenn,Bishop Lynch,73.12,272.16,145.15,242.67,659.98,Single-ply,SBD,M
Boys,74.84,2,Esteban Flores,Pharr Valley View,74.48,226.8,158.76,254.01,639.57,Single-ply,SBD,M
Boys,82.1,3,Ronald Winston,Katy Mayde Creek,75.07,233.6,147.42,251.74,632.76,Single-ply,SBD,M
Boys,74.84,4,Tristan Pelitire,Beeville Jones,74.12,235.87,170.1,224.53,630.49,Single-ply,SBD,M
Boys,74.84,5,David Martinez #14,PSJA Memorial,74.21,235.87,142.88,238.14,616.89,Single-ply,SBD,M
Boys,74.84,6,Tumarius Flowers,Mansfield Summit,73.03,219.99,138.35,247.21,605.55,Single-ply,SBD,M
Boys,74.84,7,Ryan McBride,Dayton,73.57,240.4,115.67,249.48,605.55,Single-ply,SBD,M
Boys,74.84,8,Jalen Johnson,Longview,74.84,235.87,129.27,233.6,598.74,Single-ply,SBD,M
Boys,74.84,9,Jarod Hill,Everman,72.21,242.67,136.08,217.72,596.47,Single-ply,SBD,M
Boys,74.84,10,Jacovin Coats,Marshall,72.12,226.8,113.4,249.48,589.67,Single-ply,SBD,M
Boys,74.84,11,Michael Godeaux,Vidor,73.3,238.14,131.54,217.72,587.4,Single-ply,SBD,M
Boys,74.84,12,Joe Torres #5,Los Fresnos,74.75,235.87,136.08,215.46,587.4,Single-ply,SBD,M
Boys,74.84,13,Angel Moreno,San Angelo Lake View,72.21,240.4,136.08,204.12,580.6,Single-ply,SBD,M
Boys,74.84,14,Jarad Garcia,Corpus Christi Calallen,73.94,217.72,127.01,231.33,576.06,Single-ply,SBD,M
Boys,74.84,15,Sigi Martinez,Leander Rouse,73.84,219.99,136.08,215.46,571.53,Single-ply,SBD,M
Boys,74.84,16,Zack Ponder,Plainview,74.39,224.53,113.4,206.38,544.31,Single-ply,SBD,M
Boys,74.84,DQ,Erik Estrada,Hutto,73.75,,,,,Single-ply,SBD,M
Boys,82.1,1,Abram Guerra,Rio Grande City,81.19,303.91,170.1,256.28,730.28,Single-ply,SBD,M
Boys,82.1,2,Ben Nevarrez,Edcouch-Elsa,81.92,235.87,149.69,274.42,659.98,Single-ply,SBD,M
Boys,82.1,3,Ace Clear,Bishop Lynch,78.38,263.08,142.88,249.48,655.44,Single-ply,SBD,M
Boys,82.1,4,Michael Davis #1,San Antonio East Central,81.37,260.82,138.35,251.74,650.91,Single-ply,SBD,M
Boys,82.1,5,Troy Angelo,Orange Little Cypress-Mauriceville,80.1,258.55,136.08,247.21,641.83,Single-ply,SBD,M
Boys,82.1,6,Robert Trevino,Edcouch-Elsa,81.1,251.74,140.61,244.94,637.3,Single-ply,SBD,M
Boys,82.1,7,Bacardi Clark,Mesquite Horn,77.56,265.35,133.81,231.33,630.49,Single-ply,SBD,M
Boys,82.1,8,Blake Centennial,Burleson Centennial,81.37,238.14,142.88,249.48,630.49,Single-ply,SBD,M
Boys,82.1,9,Brandon Wilson,Vidor,80.56,244.94,138.35,242.67,625.96,Single-ply,SBD,M
Boys,82.1,10,Mason Pierce,Plano John Paul II,80.1,231.33,158.76,226.8,616.89,Single-ply,SBD,M
Boys,82.1,11,Domingo Saucedo,Plainview,81.92,226.8,154.22,229.06,610.08,Single-ply,SBD,M
Boys,82.1,12,Adam Galaz,Lindale,81.37,242.67,142.88,217.72,603.28,Single-ply,SBD,M
Boys,82.1,13,Hayden Eskew,Buda Hays,80.2,226.8,154.22,215.46,596.47,Single-ply,SBD,M
Boys,82.1,14,Bryce Barrett,Waxahachie,81.92,231.33,136.08,217.72,585.13,Single-ply,SBD,M
Boys,82.1,15,Caleb Hudson,San Angelo Lake View,78.56,208.65,120.2,213.19,542.04,Single-ply,SBD,M
Boys,82.1,DQ,Erasmo Canales,Rio Grande City,81.19,,,,,Single-ply,SBD,M
Boys,82.1,DQ,Frank Perdomo,Lewisville The Colony,80.38,,,,,Single-ply,SBD,M
Boys,82.1,DQ,Toney Robinson,Dayton,81.37,,,,,Single-ply,SBD,M
Boys,82.1,DQ,David Rodriguez,Joshua,78.83,,,,,Single-ply,SBD,M
Boys,89.81,1,Collin Charles,Frisco Heritage,84.55,283.5,176.9,294.84,755.23,Single-ply,SBD,M
Boys,89.81,2,Craig Renfro,Waxahachie,87.54,285.76,149.69,285.76,721.21,Single-ply,SBD,M
Boys,89.81,3,Cody Duffey,Justin Northwest,89.54,299.37,181.44,240.4,721.21,Single-ply,SBD,M
Boys,89.81,4,Matt Ritch,San Antonio East Central,83.01,283.5,163.29,235.87,682.66,Single-ply,SBD,M
Boys,89.81,5,Kameron Handy,Corpus Christi Tuloso-Midway,87.27,274.42,154.22,251.74,680.39,Single-ply,SBD,M
Boys,89.81,6,KJ Evans,Joshua,88.99,260.82,156.49,247.21,664.51,Single-ply,SBD,M
Boys,89.81,7,Jerry DeLeon,Weslaco East,89.63,272.16,163.29,226.8,662.24,Single-ply,SBD,M
Boys,89.81,8,Victor Aguilar #2,Mercedes,88.36,249.48,158.76,244.94,653.17,Single-ply,SBD,M
Boys,89.81,9,Marlin O'Neal,Dripping Springs,89.72,256.28,154.22,242.67,653.17,Single-ply,SBD,M
Boys,99.79,10,George Stephenson,Conroe Oak Ridge,89.9,272.16,140.61,240.4,653.17,Single-ply,SBD,M
Boys,89.81,11,Jacob Almaguer,Seguin,88.63,260.82,142.88,247.21,650.91,Single-ply,SBD,M
Boys,89.81,12,Jusin Mask,Gregory-Portland,86.82,260.82,161.03,226.8,648.64,Single-ply,SBD,M
Boys,89.81,13,Coleton Boudreaux,Orange Little Cypress-Mauriceville,86.36,272.16,142.88,231.33,646.37,Single-ply,SBD,M
Boys,89.81,14,Leo Adams,Alice,88,244.94,163.29,231.33,639.57,Single-ply,SBD,M
Boys,89.81,15,Keavin Turner,Cedar Hill,89.72,260.82,138.35,240.4,639.57,Single-ply,SBD,M
Boys,89.81,16,Omar French,Longview,88.81,231.33,104.33,276.69,612.35,Single-ply,SBD,M
Boys,89.81,17,Clayton Clair,Odessa,88.63,226.8,124.74,233.6,585.13,Single-ply,SBD,M
Boys,89.81,DQ,Jacob Flores,Beeville Jones,88.36,258.55,,,,Single-ply,SBD,M
Boys,89.81,DQ,Val Hernandez,Crosby,89.63,244.94,,,,Single-ply,SBD,M
Boys,89.81,DQ,Coleton Whitlock,Midland,87,217.72,136.08,,,Single-ply,SBD,M
Boys,99.79,1,Mitchell Fountain,Conroe The Woodlands,95.44,308.44,176.9,290.3,775.64,Single-ply,SBD,M
Boys,99.79,2,Alex Tanguma,Corpus Christi Calallen,95.25,299.37,185.97,276.69,762.04,Single-ply,SBD,M
Boys,99.79,3,Drew Peterson,Dripping Springs,98.34,290.3,181.44,285.76,757.5,Single-ply,SBD,M
Boys,99.79,4,Roderick Wiltz,Houston Madison,96.25,299.37,161.03,272.16,732.55,Single-ply,SBD,M
Boys,99.79,5,Devin Bisbee,Gregory-Portland,96.52,274.42,165.56,274.42,714.41,Single-ply,SBD,M
Boys,99.79,6,Calan Johnson,Cedar Hill,97.25,265.35,188.24,256.28,709.87,Single-ply,SBD,M
Boys,99.79,7,Chris Sherill,Bay City,97.16,283.5,167.83,251.74,703.07,Single-ply,SBD,M
Boys,99.79,8,Jearld McGlothin,Mansfield Summit,96.8,247.21,156.49,285.76,689.46,Single-ply,SBD,M
Boys,99.79,9,Jesus Morales #3,Weslaco East,96.16,274.42,163.29,249.48,687.19,Single-ply,SBD,M
Boys,99.79,10,Eric Villegas,Midland,96.62,274.42,149.69,244.94,669.05,Single-ply,SBD,M
Boys,99.79,11,Marco Banda,Laredo Nixon,97.07,272.16,149.69,242.67,664.51,Single-ply,SBD,M
Boys,99.79,12,Rihl Dougherty,Dripping Springs,97.89,242.67,163.29,249.48,655.44,Single-ply,SBD,M
Boys,99.79,13,Julio Rivas,San Benito,98.25,238.14,161.03,254.01,653.17,Single-ply,SBD,M
Boys,99.79,14,Erik Mendez,Plainview,98.79,240.4,120.2,242.67,603.28,Single-ply,SBD,M
Boys,99.79,DQ,Delenis Garrett,Lindale,96.16,254.01,154.22,,,Single-ply,SBD,M
Boys,99.79,DQ,Terry Jackson,North Forney,98.7,260.82,149.69,,,Single-ply,SBD,M
Boys,99.79,DQ,Xavier Bryant,Temple,98.52,,,,,Single-ply,SBD,M
Boys,99.79,DQ,Samuel Amaka,Mansfield Timberview,97.43,283.5,147.42,,,Single-ply,SBD,M
Boys,99.79,DQ,Alejandro Anzaldua,Mansfield Timberview,97.7,283.5,161.03,,,Single-ply,SBD,M
Boys,109.77,DQ,Matthew Moore,Beaumont Central,100.02,272.16,165.56,,,Single-ply,SBD,M
Boys,109.77,1,Eddie Calico,Longview Pine Tree,107.95,335.66,210.92,299.37,845.95,Single-ply,SBD,M
Boys,109.77,2,Pj Hall,Seguin,109.32,324.32,172.37,299.37,796.05,Single-ply,SBD,M
Boys,109.77,3,Isaiah Hinton,Lewisville The Colony,102.51,312.98,185.97,281.23,780.18,Single-ply,SBD,M
Boys,109.77,4,Aaron Allen #2,San Angelo Lake View,108.77,306.17,151.95,306.17,764.3,Single-ply,SBD,M
Boys,109.77,5,Clayton Anderson,Elgin,108.41,299.37,199.58,260.82,759.77,Single-ply,SBD,M
Boys,109.77,6,Dakota Cooksy,Corpus Christi Calallen,106.96,299.37,165.56,272.16,737.09,Single-ply,SBD,M
Boys,109.77,7,Justin Latanero,Conroe Oak Ridge,107.32,283.5,183.7,235.87,703.07,Single-ply,SBD,M
Boys,124.74,8,Tremonte Green,Crosby,109.86,274.42,172.37,249.48,696.26,Single-ply,SBD,M
Boys,109.77,9,Reno Dominguez,Katy Mayde Creek,108.05,299.37,124.74,244.94,669.05,Single-ply,SBD,M
Boys,109.77,10,Blade Bronstad,Corpus Christi Calallen,107.59,285.76,124.74,256.28,666.78,Single-ply,SBD,M
Boys,109.77,11,Stetson Farrell,Lindale,106.14,254.01,172.37,208.65,635.03,Single-ply,SBD,M
Boys,109.77,12,Andrew Abamu,Cedar Hill,102.06,242.67,122.47,260.82,625.96,Single-ply,SBD,M
Boys,109.77,13,Anthony McLendon,Abilene,106.14,231.33,145.15,219.99,596.47,Single-ply,SBD,M
Boys,109.77,DQ,Baliey Rhoads,Buda Hays,105.51,,,,,Single-ply,SBD,M
Boys,109.77,DQ,Parker Blount,Huntsville,107.68,272.16,,,,Single-ply,SBD,M
Boys,109.77,DQ,Jeremy Chamberlain,San Antonio East Central,102.33,244.94,,,,Single-ply,SBD,M
Boys,124.74,1,Albert Willingham,Fort Worth Western Hills,123.2,365.14,229.06,233.6,827.81,Single-ply,SBD,M
Boys,124.74,2,Jesus Esparza,Pharr Valley View,119.66,294.84,183.7,292.57,771.11,Single-ply,SBD,M
Boys,124.74,3,Travis Stubblefield,Justin Northwest,120.66,317.51,199.58,254.01,771.11,Single-ply,SBD,M
Boys,124.74,4,Pete Lozano,San Benito,123.38,303.91,192.78,272.16,768.84,Single-ply,SBD,M
Boys,124.74,5,Justin Bigelow,Denison,118.75,283.5,183.7,272.16,739.36,Single-ply,SBD,M
Boys,124.74,6,Ethan Dobbs,Rockwall-Heath,124.56,312.98,179.17,244.94,737.09,Single-ply,SBD,M
Boys,124.74,7,Matt Oubre,Dayton,122.38,283.5,192.78,249.48,725.75,Single-ply,SBD,M
Boys,124.74,8,Justin Lewis,Texarkana Texas,118.48,294.84,163.29,256.28,714.41,Single-ply,SBD,M
Boys,124.74,9,Curtis Emery,Alvin,117.48,290.3,158.76,254.01,703.07,Single-ply,SBD,M
Boys,124.74,10,Chris Shepherd,Alvin,115.3,269.89,147.42,276.69,694,Single-ply,SBD,M
Boys,124.74,11,Jose Flores #2,Laredo Cigarroa,123.01,240.4,183.7,244.94,669.05,Single-ply,SBD,M
Boys,124.74,12,James Lockhart,Ennis,115.3,260.82,156.49,249.48,666.78,Single-ply,SBD,M
Boys,124.74,13,Colton Hostetler,Burleson Centennial,119.57,260.82,149.69,254.01,664.51,Single-ply,SBD,M
Boys,124.74,14,Chantz Anderson,Abilene,114.49,272.16,161.03,201.85,635.03,Single-ply,SBD,M
Boys,124.74,DQ,Charles Hunt,Midland,124.28,244.94,188.24,,,Single-ply,SBD,M
Boys,124.74,DQ,Ivan Garciduenas,Burleson Centennial,118.93,,,,,Single-ply,SBD,M
Boys,124.74+,1,Andrew Billings #1,Waco,146.65,365.14,226.8,319.78,911.72,Single-ply,SBD,M
Boys,124.74+,2,Kenny Higgins,Kyle Lehman,139.53,349.27,219.99,292.57,861.83,Single-ply,SBD,M
Boys,124.74+,3,Ben Hughes,Waco University,148.87,308.44,195.04,331.12,834.61,Single-ply,SBD,M
Boys,124.74+,4,Luke Young #2,Keller,137.98,351.53,206.38,272.16,830.07,Single-ply,SBD,M
Boys,124.74+,5,Ray Sedwick,Lockhart,132.9,328.85,197.31,297.1,823.27,Single-ply,SBD,M
Boys,124.74+,6,Travis Romero,Manvel,166.11,331.12,199.58,285.76,816.47,Single-ply,SBD,M
Boys,124.74+,7,Davonte Moore,Temple,144.33,351.53,188.24,260.82,800.59,Single-ply,SBD,M
Boys,124.74+,8,Michael Castle,Lewisville Marcus,139.43,328.85,215.46,226.8,771.11,Single-ply,SBD,M
Boys,124.74+,9,Julian Salmond,Fort Worth Western Hills,128.09,324.32,170.1,272.16,766.57,Single-ply,SBD,M
Boys,124.74+,10,Vincent Wurst,Bishop Lynch,143.61,317.51,188.24,249.48,755.23,Single-ply,SBD,M
Boys,124.74+,11,Rudy Flores,Laredo United South,140.61,299.37,176.9,272.16,748.43,Single-ply,SBD,M
Boys,124.74+,12,Josue Garzoria,Los Fresnos,140.61,308.44,183.7,254.01,746.16,Single-ply,SBD,M
Boys,124.74+,13,Nick O'Bryant,Castroville Medina Valley,136.62,312.98,181.44,249.48,743.89,Single-ply,SBD,M
Boys,124.74+,14,Kevin Blessing,Lewisville Marcus,147.15,310.71,176.9,256.28,743.89,Single-ply,SBD,M
Boys,124.74+,15,Steven Patton,Red Oak,142.07,294.84,167.83,240.4,703.07,Single-ply,SBD,M
Boys,124.74+,16,Andrew Bluiett,Beaumont West Brook,160.39,249.48,154.22,283.5,687.19,Single-ply,SBD,M
Boys,124.74+,17,Riley Owens,Abilene Cooper,132.72,260.82,136.08,249.48,646.37,Single-ply,SBD,M
Boys,124.74+,DQ,William Simpson,Houston Madison,141.88,317.51,183.7,,,Single-ply,SBD,M
Boys,124.74+,DQ,Jordan Copeland,Midland,145.33,256.28,195.04,,,Single-ply,SBD,M
Boys,124.74+,DQ,Montrel Newson,Ennis,173.73,303.91,151.95,,,Single-ply,SBD,M
