{
  "2008": { "name": "SE Marsh", "matches": 5 },
  "2009": { "name": "YK Pathan", "matches": 3 },
  "2010": { "name": "SR Tendulkar", "matches": 4 },
  "2011": { "name": "CH Gayle", "matches": 6 },
  "2012": { "name": "CH Gayle", "matches": 5 },
  "2013": { "name": "MEK Hussey", "matches": 5 },
  "2014": { "name": "GJ Maxwell", "matches": 4 },
  "2015": { "name": "DA Warner", "matches": 4 },
  "2016": { "name": "V Kohli", "matches": 5 },
  "2017": { "name": "BA Stokes", "matches": 3 }
}
