%YAML 1.1
%TAG !u! tag:unity3d.com,2011:
--- !u!1045 &1
EditorBuildSettings:
  m_ObjectHideFlags: 0
  serializedVersion: 2
  m_Scenes:
  - enabled: 1
    path: Assets/Scenes/EntranceScene.unity
    guid: bff114e60abbbf342a45db14502469b6
  - enabled: 1
    path: Assets/Scenes/LobbyScene.unity
    guid: 24cb1e5bee1badb4eac4edc87295ba5a
  - enabled: 1
    path: Assets/Scenes/VenueScene.unity
    guid: 9fc0d4010bbf28b4594072e72b8655ab
  - enabled: 1
    path: Assets/Scenes/Venue3DScene.unity
    guid: 179e2e786b20c054ebe82d29ddda2f02
  - enabled: 1
    path: Assets/Scenes/ResultScene.unity
    guid: 960b2997f6710274a8f56512bb6f4c07
  m_configObjects:
    UnityEditor.XR.ARCore.ARCoreSettings: {fileID: 11400000, guid: 80d51841cf75f49bc9bb43e2be84d71c,
      type: 2}
    UnityEditor.XR.ARKit.ARKitSettings: {fileID: 11400000, guid: 394f7a346964640b8a383171838f05dc,
      type: 2}
    com.unity.xr.management.loader_settings: {fileID: 11400000, guid: fd09098226e846f469d70f86a894be3c,
      type: 2}
