{
	"QMainWindow":[
		{
			"tittle":"Aivero Setup Wizard",
			"icon":":/icons/icons/Aivero_logo_facebook_170x170.svg",
			"frameless": true,
			"transluscentBg": false,
			"navigation":[
				{
					"minimize":"minimize_window_button",
					"close": "close_window_button",
					"moveWindow": "header_frame"
				}
			]
		}
	],
	"QStackedWidget":[
		{
			"name":"myStackedWidget"
	
		}
	],
	"QCustomSlideMenu": [
		{
		"name": "pages",
		"defaultSize": [{
			"width": 0,
			"height": "parent"
		}],
		"collapsedSize": [{
			"width": 0,
			"height": "parent"
		}],
		"expandedSize": [{
			"width": "auto",
			"height": "parent"
		}]

		},{
		"name": "welcome",
		"defaultSize": [{
			"width": "auto",
			"height": "auto"
		}],
		"collapsedSize": [{
			"width": 0,
			"height": "parent"
		}],
		"expandedSize": [{
			"width": "auto",
			"height": "parent"
		}]
		},{
		"name": "exit_container",
		"defaultSize": [{
			"width": 0,
			"height": 0
		}],
		"collapsedSize": [{
			"width": 0,
			"height": 0
		}],
		"expandedSize": [{
			"width": "auto",
			"height": "auto"
		}]
		},{
		"name": "licensing_container",
		"defaultSize": [{
			"width": 0,
			"height": 0
		}],
		"collapsedSize": [{
			"width": 0,
			"height": 0
		}],
		"expandedSize": [{
			"width": "auto",
			"height": "auto"
		}]
		},{
		"name": "main_contents",
		"defaultSize": [{
			"width": "auto",
			"height": "auto"
		}],
		"collapsedSize": [{
			"width": 0,
			"height": 0
		}],
		"expandedSize": [{
			"width": "auto",
			"height": "auto"
		}]
		}
	]
}
