open Jobt

type set = {
  set: string,
  val: string,
}

type opt = {
  opt: string,
  val: string,
}

type mode = [
  | #docker
  | #command
]

type t = {
  name: string,
  version: string,
  folder: string,
  mode: mode,
  modeInt: Yaml.t,
  commit: option<string>,
  branch: option<string>,
  needs: array<string>,
  trigger: array<string>,
  bootstrap: bool,
  profiles: array<string>,
  beforeScript: array<string>,
  script: array<string>,
  afterScript: array<string>,
  image: option<string>,
  tags: array<string>,
  cache: option<Jobt.cache>,
  manual: option<bool>,
  rules: option<array<Jobt.rule>>,
  variables: Dict.t<string>,
  interruptible: bool,
}

let parseMode = str => {
  switch str {
  | "docker" => #docker
  | _ => #command
  }
}

let modeToString = mode => {
  switch mode {
  | #docker => "docker"
  | #command => "command"
  }
}

let create = (int: Yaml.t, folderPath): t => {
  let name = switch int->Yaml.get("name") {
  | Yaml.String(name) => name
  | _ => Path.basename(folderPath)
  }
  let version = switch (int->Yaml.get("version"), Env.get("CI_COMMIT_SHA")) {
  | (Yaml.String(version), _) => version
  | (Yaml.Number(version), _) => version->Float.toString
  | (_, Some(sha)) => sha
  | _ => "0.0.0"
  }
  // Conan has a 50 char limit for versions
  let version = version->String.slice(~from=0, ~to_=50)
  let folder = switch int->Yaml.get("folder") {
  | Yaml.String(folder) => Path.join([folderPath, folder])
  | _ => folderPath
  }
  let mode = switch int->Yaml.get("mode") {
  | Yaml.String(mode) => parseMode(mode)
  | _ if Path.read(folder)->Array.some(file => file.name->String.includes("Dockerfile")) => #docker
  | _ => #command
  }
  let modeInt = switch mode {
  | #docker => int->Yaml.get("docker")
  | _ => Yaml.Null
  }
  let commit = switch int->Yaml.get("commit") {
  | Yaml.String(commit) => Some(commit)
  | _ => Env.get("CI_COMMIT_SHA")
  }
  let branch = switch int->Yaml.get("branch") {
  | Yaml.String(branch) => Some(branch)
  | _ => Env.get("CI_COMMIT_REF_NAME")
  }
  let reqs = switch int->Yaml.get("reqs") {
  | Yaml.Array(reqs) => reqs->Array.reduce((reqs, req) =>
      switch req {
      | Yaml.String(req) => reqs->Array.concat([req])
      | _ => []
      }
    , [])
  | Yaml.String(req) => [req]
  | _ => []
  }
  let trigger = switch int->Yaml.get("trigger") {
  | Yaml.Array(trigger) => trigger->Array.reduce((ints, int) =>
      switch int {
      | Yaml.String(int) => ints->Array.concat([int])
      | _ => []
      }
    , [])
  | Yaml.String(int) => [int]
  | _ => []
  }
  let bootstrap = switch int->Yaml.get("bootstrap") {
  | Yaml.Bool(bool) => bool
  | _ => false
  }
  let manual = switch int->Yaml.get("manual") {
  | Yaml.Bool(manual) => Some(manual)
  | _ => None
  }
  let image = switch int->Yaml.get("image") {
  | Yaml.String(image) => Some(image)
  | _ => None
  }
  let tags = switch int->Yaml.get("tags") {
  | Yaml.Array(tags) => tags->Array.reduce((tags, tag) =>
      switch tag {
      | Yaml.String(tag) => tags->Array.concat([tag])
      | _ => []
      }
    , [])
  | _ => []
  }
  let profiles = switch int->Yaml.get("profiles") {
  | Array(profiles) => profiles->Array.reduce((array, profile) =>
      switch profile {
      | String(profile) => array->Array.concat([profile])
      | _ => array
      }
    , [])
  | _ => ["linux-x86_64", "linux-armv8"]
  }
  let beforeScript = switch int->Yaml.get("before_script") {
  | Yaml.Array(cmds) => cmds->Array.reduce((cmds, cmd) =>
      switch cmd {
      | Yaml.String(cmd) => cmds->Array.concat([cmd])
      | _ => []
      }
    , [])
  | Yaml.String(cmd) => [cmd]
  | _ => []
  }
  let script = switch int->Yaml.get("script") {
  | Yaml.Array(cmds) => cmds->Array.reduce((cmds, cmd) =>
      switch cmd {
      | Yaml.String(cmd) => cmds->Array.concat([cmd])
      | _ => []
      }
    , [])
  | Yaml.String(cmd) => [cmd]
  | _ => []
  }
  let afterScript = switch int->Yaml.get("after_script") {
  | Yaml.Array(cmds) => cmds->Array.reduce((cmds, cmd) =>
      switch cmd {
      | Yaml.String(cmd) => cmds->Array.concat([cmd])
      | _ => []
      }
    , [])
  | Yaml.String(cmd) => [cmd]
  | _ => []
  }
  let cache = int->Yaml.get("cache")
  let cache = switch (cache->Yaml.get("key"), cache->Yaml.get("paths")) {
  | (Yaml.String(key), Yaml.Array(paths)) => {
      let paths = paths->Array.reduce((paths, path) =>
        switch path {
        | Yaml.String(path) => paths->Array.concat([Path.join([folder, path])])
        | _ => []
        }
      , [])
      Some({key: Some(key), paths: paths})
    }
  | (_, Yaml.Array(paths)) => {
      let paths = paths->Array.reduce((paths, path) =>
        switch path {
        | Yaml.String(path) => paths->Array.concat([Path.join([folder, path])])
        | _ => []
        }
      , [])
      Some({key: None, paths: paths})
    }
  | _ => None
  }
  let rules = int->Yaml.get("rules")
  let rules: option<array<rule>> = switch rules {
  | Yaml.Array(rulesArray) =>
    let array = rulesArray->Array.reduce((rulesAcc, rule) => {
      switch (rule->Yaml.get("if"), rule->Yaml.get("when")) {
      | (Yaml.String(entryIf), Yaml.String(entryWhen)) =>
        rulesAcc->Array.concat([
          {
            \"if": Some(entryIf),
            \"when": Some(entryWhen),
          },
        ])

      | (Yaml.String(entryIf), _) =>
        rulesAcc->Array.concat([
          {
            \"if": Some(entryIf),
            \"when": None,
          },
        ])
      | _ => []
      }
    }, [])
    if array->Array.length >= 0 {
      Some(array)
    } else {
      None
    }
  | _ => None
  }
  let variables = switch int->Yaml.get("variables") {
  | Yaml.Object(sets) => sets->Dict.toArray->Array.reduce((elems, (key, val)) =>
      switch (key, val) {
      | (key, Yaml.String(val)) => elems->Array.concat([(key, val)])
      | _ => elems
      }
    , [])->Dict.fromArray
  | _ => Dict.empty()
  }

  {
    name: name,
    version: version,
    folder: folder,
    mode: mode,
    modeInt: modeInt,
    commit: commit,
    branch: branch,
    needs: reqs,
    trigger: trigger,
    bootstrap: bootstrap,
    beforeScript: beforeScript,
    script: script,
    afterScript: afterScript,
    profiles: profiles,
    image: image,
    tags: tags,
    cache: cache,
    manual: manual,
    rules: rules,
    variables: variables,
    interruptible: false,
  }
}
