%YAML 1.1
%TAG !u! tag:unity3d.com,2011:
--- !u!74 &7400000
AnimationClip:
  m_ObjectHideFlags: 0
  m_CorrespondingSourceObject: {fileID: 0}
  m_PrefabInstance: {fileID: 0}
  m_PrefabAsset: {fileID: 0}
  m_Name: falling
  serializedVersion: 6
  m_Legacy: 0
  m_Compressed: 0
  m_UseHighQualityCurve: 1
  m_RotationCurves: []
  m_CompressedRotationCurves: []
  m_EulerCurves: []
  m_PositionCurves: []
  m_ScaleCurves: []
  m_FloatCurves: []
  m_PPtrCurves:
  - curve:
    - time: 0
      value: {fileID: 309542010, guid: 3a0549f7c96d79a41968c2194e3a82e7, type: 3}
    - time: 0.016666668
      value: {fileID: -1451967773, guid: 3a0549f7c96d79a41968c2194e3a82e7, type: 3}
    - time: 0.033333335
      value: {fileID: -184367548, guid: 3a0549f7c96d79a41968c2194e3a82e7, type: 3}
    - time: 0.05
      value: {fileID: 1100799711, guid: 3a0549f7c96d79a41968c2194e3a82e7, type: 3}
    - time: 0.06666667
      value: {fileID: 1001674930, guid: 3a0549f7c96d79a41968c2194e3a82e7, type: 3}
    - time: 0.083333336
      value: {fileID: 1755454343, guid: 3a0549f7c96d79a41968c2194e3a82e7, type: 3}
    - time: 0.1
      value: {fileID: -333104308, guid: 3a0549f7c96d79a41968c2194e3a82e7, type: 3}
    - time: 0.11666667
      value: {fileID: -1646048657, guid: 3a0549f7c96d79a41968c2194e3a82e7, type: 3}
    - time: 0.13333334
      value: {fileID: 384582079, guid: 3a0549f7c96d79a41968c2194e3a82e7, type: 3}
    - time: 0.15
      value: {fileID: -912541962, guid: 3a0549f7c96d79a41968c2194e3a82e7, type: 3}
    - time: 0.16666667
      value: {fileID: 1393721873, guid: 3a0549f7c96d79a41968c2194e3a82e7, type: 3}
    - time: 0.18333334
      value: {fileID: -1793437080, guid: 3a0549f7c96d79a41968c2194e3a82e7, type: 3}
    - time: 0.2
      value: {fileID: 2109166950, guid: 3a0549f7c96d79a41968c2194e3a82e7, type: 3}
    - time: 0.21666667
      value: {fileID: 192664961, guid: 3a0549f7c96d79a41968c2194e3a82e7, type: 3}
    - time: 0.23333333
      value: {fileID: 969329926, guid: 3a0549f7c96d79a41968c2194e3a82e7, type: 3}
    - time: 0.25
      value: {fileID: 2135528778, guid: 3a0549f7c96d79a41968c2194e3a82e7, type: 3}
    - time: 0.26666668
      value: {fileID: -1561259164, guid: 3a0549f7c96d79a41968c2194e3a82e7, type: 3}
    - time: 0.28333333
      value: {fileID: -1946450657, guid: 3a0549f7c96d79a41968c2194e3a82e7, type: 3}
    - time: 0.3
      value: {fileID: -1809404636, guid: 3a0549f7c96d79a41968c2194e3a82e7, type: 3}
    - time: 0.31666666
      value: {fileID: -1274598263, guid: 3a0549f7c96d79a41968c2194e3a82e7, type: 3}
    - time: 0.33333334
      value: {fileID: 1461081097, guid: 3a0549f7c96d79a41968c2194e3a82e7, type: 3}
    - time: 0.35
      value: {fileID: 1389199307, guid: 3a0549f7c96d79a41968c2194e3a82e7, type: 3}
    - time: 0.36666667
      value: {fileID: 946536347, guid: 3a0549f7c96d79a41968c2194e3a82e7, type: 3}
    - time: 0.38333333
      value: {fileID: -1494605814, guid: 3a0549f7c96d79a41968c2194e3a82e7, type: 3}
    - time: 0.4
      value: {fileID: 1953737935, guid: 3a0549f7c96d79a41968c2194e3a82e7, type: 3}
    - time: 0.41666666
      value: {fileID: 332150876, guid: 3a0549f7c96d79a41968c2194e3a82e7, type: 3}
    - time: 0.43333334
      value: {fileID: -883603274, guid: 3a0549f7c96d79a41968c2194e3a82e7, type: 3}
    - time: 0.45
      value: {fileID: -305038802, guid: 3a0549f7c96d79a41968c2194e3a82e7, type: 3}
    - time: 0.46666667
      value: {fileID: 592890751, guid: 3a0549f7c96d79a41968c2194e3a82e7, type: 3}
    - time: 0.48333332
      value: {fileID: 150720273, guid: 3a0549f7c96d79a41968c2194e3a82e7, type: 3}
    - time: 0.5
      value: {fileID: -1997572189, guid: 3a0549f7c96d79a41968c2194e3a82e7, type: 3}
    - time: 0.51666665
      value: {fileID: -907691000, guid: 3a0549f7c96d79a41968c2194e3a82e7, type: 3}
    - time: 0.53333336
      value: {fileID: -2029406566, guid: 3a0549f7c96d79a41968c2194e3a82e7, type: 3}
    - time: 0.55
      value: {fileID: 1357978886, guid: 3a0549f7c96d79a41968c2194e3a82e7, type: 3}
    - time: 0.56666666
      value: {fileID: -521859611, guid: 3a0549f7c96d79a41968c2194e3a82e7, type: 3}
    - time: 0.5833333
      value: {fileID: 1516328651, guid: 3a0549f7c96d79a41968c2194e3a82e7, type: 3}
    - time: 0.6
      value: {fileID: -2111063193, guid: 3a0549f7c96d79a41968c2194e3a82e7, type: 3}
    - time: 0.6166667
      value: {fileID: 1454803218, guid: 3a0549f7c96d79a41968c2194e3a82e7, type: 3}
    - time: 0.6333333
      value: {fileID: 1603732105, guid: 3a0549f7c96d79a41968c2194e3a82e7, type: 3}
    - time: 0.65
      value: {fileID: -989476502, guid: 3a0549f7c96d79a41968c2194e3a82e7, type: 3}
    - time: 0.6666667
      value: {fileID: -1643531712, guid: 3a0549f7c96d79a41968c2194e3a82e7, type: 3}
    - time: 0.68333334
      value: {fileID: 1047359370, guid: 3a0549f7c96d79a41968c2194e3a82e7, type: 3}
    - time: 0.7
      value: {fileID: -848594359, guid: 3a0549f7c96d79a41968c2194e3a82e7, type: 3}
    - time: 0.71666664
      value: {fileID: -749867292, guid: 3a0549f7c96d79a41968c2194e3a82e7, type: 3}
    - time: 0.73333335
      value: {fileID: 1595280397, guid: 3a0549f7c96d79a41968c2194e3a82e7, type: 3}
    - time: 0.75
      value: {fileID: -1679157117, guid: 3a0549f7c96d79a41968c2194e3a82e7, type: 3}
    - time: 0.76666665
      value: {fileID: -496593593, guid: 3a0549f7c96d79a41968c2194e3a82e7, type: 3}
    - time: 0.78333336
      value: {fileID: 1756938764, guid: 3a0549f7c96d79a41968c2194e3a82e7, type: 3}
    - time: 0.8
      value: {fileID: 140398940, guid: 3a0549f7c96d79a41968c2194e3a82e7, type: 3}
    - time: 0.81666666
      value: {fileID: 195131395, guid: 3a0549f7c96d79a41968c2194e3a82e7, type: 3}
    - time: 0.8333333
      value: {fileID: 1608484050, guid: 3a0549f7c96d79a41968c2194e3a82e7, type: 3}
    - time: 0.85
      value: {fileID: 1122799021, guid: 3a0549f7c96d79a41968c2194e3a82e7, type: 3}
    - time: 0.8666667
      value: {fileID: -1329366762, guid: 3a0549f7c96d79a41968c2194e3a82e7, type: 3}
    - time: 0.8833333
      value: {fileID: -1764104440, guid: 3a0549f7c96d79a41968c2194e3a82e7, type: 3}
    - time: 0.9
      value: {fileID: 1808015992, guid: 3a0549f7c96d79a41968c2194e3a82e7, type: 3}
    - time: 0.9166667
      value: {fileID: -1659608425, guid: 3a0549f7c96d79a41968c2194e3a82e7, type: 3}
    - time: 0.93333334
      value: {fileID: 543330959, guid: 3a0549f7c96d79a41968c2194e3a82e7, type: 3}
    - time: 0.95
      value: {fileID: 1934676202, guid: 3a0549f7c96d79a41968c2194e3a82e7, type: 3}
    - time: 0.96666664
      value: {fileID: -1655245877, guid: 3a0549f7c96d79a41968c2194e3a82e7, type: 3}
    - time: 0.98333335
      value: {fileID: -1307325883, guid: 3a0549f7c96d79a41968c2194e3a82e7, type: 3}
    - time: 1
      value: {fileID: 1139698276, guid: 3a0549f7c96d79a41968c2194e3a82e7, type: 3}
    attribute: m_Sprite
    path: 
    classID: 212
    script: {fileID: 0}
  m_SampleRate: 60
  m_WrapMode: 0
  m_Bounds:
    m_Center: {x: 0, y: 0, z: 0}
    m_Extent: {x: 0, y: 0, z: 0}
  m_ClipBindingConstant:
    genericBindings:
    - serializedVersion: 2
      path: 0
      attribute: 0
      script: {fileID: 0}
      typeID: 212
      customType: 23
      isPPtrCurve: 1
    pptrCurveMapping:
    - {fileID: 309542010, guid: 3a0549f7c96d79a41968c2194e3a82e7, type: 3}
    - {fileID: -1451967773, guid: 3a0549f7c96d79a41968c2194e3a82e7, type: 3}
    - {fileID: -184367548, guid: 3a0549f7c96d79a41968c2194e3a82e7, type: 3}
    - {fileID: 1100799711, guid: 3a0549f7c96d79a41968c2194e3a82e7, type: 3}
    - {fileID: 1001674930, guid: 3a0549f7c96d79a41968c2194e3a82e7, type: 3}
    - {fileID: 1755454343, guid: 3a0549f7c96d79a41968c2194e3a82e7, type: 3}
    - {fileID: -333104308, guid: 3a0549f7c96d79a41968c2194e3a82e7, type: 3}
    - {fileID: -1646048657, guid: 3a0549f7c96d79a41968c2194e3a82e7, type: 3}
    - {fileID: 384582079, guid: 3a0549f7c96d79a41968c2194e3a82e7, type: 3}
    - {fileID: -912541962, guid: 3a0549f7c96d79a41968c2194e3a82e7, type: 3}
    - {fileID: 1393721873, guid: 3a0549f7c96d79a41968c2194e3a82e7, type: 3}
    - {fileID: -1793437080, guid: 3a0549f7c96d79a41968c2194e3a82e7, type: 3}
    - {fileID: 2109166950, guid: 3a0549f7c96d79a41968c2194e3a82e7, type: 3}
    - {fileID: 192664961, guid: 3a0549f7c96d79a41968c2194e3a82e7, type: 3}
    - {fileID: 969329926, guid: 3a0549f7c96d79a41968c2194e3a82e7, type: 3}
    - {fileID: 2135528778, guid: 3a0549f7c96d79a41968c2194e3a82e7, type: 3}
    - {fileID: -1561259164, guid: 3a0549f7c96d79a41968c2194e3a82e7, type: 3}
    - {fileID: -1946450657, guid: 3a0549f7c96d79a41968c2194e3a82e7, type: 3}
    - {fileID: -1809404636, guid: 3a0549f7c96d79a41968c2194e3a82e7, type: 3}
    - {fileID: -1274598263, guid: 3a0549f7c96d79a41968c2194e3a82e7, type: 3}
    - {fileID: 1461081097, guid: 3a0549f7c96d79a41968c2194e3a82e7, type: 3}
    - {fileID: 1389199307, guid: 3a0549f7c96d79a41968c2194e3a82e7, type: 3}
    - {fileID: 946536347, guid: 3a0549f7c96d79a41968c2194e3a82e7, type: 3}
    - {fileID: -1494605814, guid: 3a0549f7c96d79a41968c2194e3a82e7, type: 3}
    - {fileID: 1953737935, guid: 3a0549f7c96d79a41968c2194e3a82e7, type: 3}
    - {fileID: 332150876, guid: 3a0549f7c96d79a41968c2194e3a82e7, type: 3}
    - {fileID: -883603274, guid: 3a0549f7c96d79a41968c2194e3a82e7, type: 3}
    - {fileID: -305038802, guid: 3a0549f7c96d79a41968c2194e3a82e7, type: 3}
    - {fileID: 592890751, guid: 3a0549f7c96d79a41968c2194e3a82e7, type: 3}
    - {fileID: 150720273, guid: 3a0549f7c96d79a41968c2194e3a82e7, type: 3}
    - {fileID: -1997572189, guid: 3a0549f7c96d79a41968c2194e3a82e7, type: 3}
    - {fileID: -907691000, guid: 3a0549f7c96d79a41968c2194e3a82e7, type: 3}
    - {fileID: -2029406566, guid: 3a0549f7c96d79a41968c2194e3a82e7, type: 3}
    - {fileID: 1357978886, guid: 3a0549f7c96d79a41968c2194e3a82e7, type: 3}
    - {fileID: -521859611, guid: 3a0549f7c96d79a41968c2194e3a82e7, type: 3}
    - {fileID: 1516328651, guid: 3a0549f7c96d79a41968c2194e3a82e7, type: 3}
    - {fileID: -2111063193, guid: 3a0549f7c96d79a41968c2194e3a82e7, type: 3}
    - {fileID: 1454803218, guid: 3a0549f7c96d79a41968c2194e3a82e7, type: 3}
    - {fileID: 1603732105, guid: 3a0549f7c96d79a41968c2194e3a82e7, type: 3}
    - {fileID: -989476502, guid: 3a0549f7c96d79a41968c2194e3a82e7, type: 3}
    - {fileID: -1643531712, guid: 3a0549f7c96d79a41968c2194e3a82e7, type: 3}
    - {fileID: 1047359370, guid: 3a0549f7c96d79a41968c2194e3a82e7, type: 3}
    - {fileID: -848594359, guid: 3a0549f7c96d79a41968c2194e3a82e7, type: 3}
    - {fileID: -749867292, guid: 3a0549f7c96d79a41968c2194e3a82e7, type: 3}
    - {fileID: 1595280397, guid: 3a0549f7c96d79a41968c2194e3a82e7, type: 3}
    - {fileID: -1679157117, guid: 3a0549f7c96d79a41968c2194e3a82e7, type: 3}
    - {fileID: -496593593, guid: 3a0549f7c96d79a41968c2194e3a82e7, type: 3}
    - {fileID: 1756938764, guid: 3a0549f7c96d79a41968c2194e3a82e7, type: 3}
    - {fileID: 140398940, guid: 3a0549f7c96d79a41968c2194e3a82e7, type: 3}
    - {fileID: 195131395, guid: 3a0549f7c96d79a41968c2194e3a82e7, type: 3}
    - {fileID: 1608484050, guid: 3a0549f7c96d79a41968c2194e3a82e7, type: 3}
    - {fileID: 1122799021, guid: 3a0549f7c96d79a41968c2194e3a82e7, type: 3}
    - {fileID: -1329366762, guid: 3a0549f7c96d79a41968c2194e3a82e7, type: 3}
    - {fileID: -1764104440, guid: 3a0549f7c96d79a41968c2194e3a82e7, type: 3}
    - {fileID: 1808015992, guid: 3a0549f7c96d79a41968c2194e3a82e7, type: 3}
    - {fileID: -1659608425, guid: 3a0549f7c96d79a41968c2194e3a82e7, type: 3}
    - {fileID: 543330959, guid: 3a0549f7c96d79a41968c2194e3a82e7, type: 3}
    - {fileID: 1934676202, guid: 3a0549f7c96d79a41968c2194e3a82e7, type: 3}
    - {fileID: -1655245877, guid: 3a0549f7c96d79a41968c2194e3a82e7, type: 3}
    - {fileID: -1307325883, guid: 3a0549f7c96d79a41968c2194e3a82e7, type: 3}
    - {fileID: 1139698276, guid: 3a0549f7c96d79a41968c2194e3a82e7, type: 3}
  m_AnimationClipSettings:
    serializedVersion: 2
    m_AdditiveReferencePoseClip: {fileID: 0}
    m_AdditiveReferencePoseTime: 0
    m_StartTime: 0
    m_StopTime: 1.0166667
    m_OrientationOffsetY: 0
    m_Level: 0
    m_CycleOffset: 0
    m_HasAdditiveReferencePose: 0
    m_LoopTime: 1
    m_LoopBlend: 0
    m_LoopBlendOrientation: 0
    m_LoopBlendPositionY: 0
    m_LoopBlendPositionXZ: 0
    m_KeepOriginalOrientation: 0
    m_KeepOriginalPositionY: 1
    m_KeepOriginalPositionXZ: 0
    m_HeightFromFeet: 0
    m_Mirror: 0
  m_EditorCurves: []
  m_EulerEditorCurves: []
  m_HasGenericRootTransform: 0
  m_HasMotionFloatCurves: 0
  m_Events: []
