id,name,model_id:id,group_id:id,perm_read,perm_write,perm_create,perm_unlink
access_sale_order_packs_usr,access_sale_order_packs_usr,model_sale_order_packs,base.group_user,1,0,0,0
access_sale_order_packs_man,access_sale_order_packs_man,model_sale_order_packs,base.group_erp_manager,1,1,1,1
,,,,,,