<svg width="1280" height="720" viewBox="0 0 1280 720" fill="none" xmlns="http://www.w3.org/2000/svg">
<path d="M0 0H1280V335C780.129 335 499.871 335 0 335V0Z" fill="#3F5B90"/>
<path d="M0 313H1280V720H0V313Z" fill="#FF9885"/>
</svg>
