
// Check in the Header if any old value matches


 token = response.headers.authorization;
        console.log(response.headers.authorization);
        console.log(token);
        localStorage.setItem("token", response.headers.authorization);

app.get('/meetings/:id/verify', async (req, res)=>{
    
    try {
        const token = req.header('Authorization')
        const key = datastore.key(['Meeting', req.params.id]);
        console.log(key);
        const meeting = await datastore.get(key);
        console.log(meeting);
        if (!token || !meeting){
            throw new Error();
        }
        res.send(meeting);
    } catch (error) {
        res.send(error);
        res.status(404);
    }    
});


DB Password:  szrcy5Grn96b9B2n
Database:  meetingsdb
host:  35.238.116.208


https://kubernetes.io/docs/concepts/configuration/secret/