;ST_NUM;ST_NAME;OWN_OCCUPIED_N;OWN_OCCUPIED_Y;NUM_BEDROOMS;NUM_BATH;SQ_FT;REVENUE
0;104;PUTNAM;0;1;1.0;0.0;0.3333333333333333;0.5357142857142857
1;197;LEXINGTON;1;0;1.0;0.0;0.49333333333333335;0.35714285714285715
2;201;BERKELEY;1;0;0.0;0.0;0.0;0.0
3;203;BERKELEY;0;1;1.0;1.0;1.0;1.0
4;210;WASHINGTON;1;0;0.5;0.0;0.2777777777777778;0.03571428571428571
