Place,Name,Sex,Country,Equipment,Division,BodyweightKg,WeightClassKg,Squat1Kg,Squat2Kg,Squat3Kg,Best3SquatKg,Bench1Kg,Bench2Kg,Bench3Kg,Best3BenchKg,Deadlift1Kg,Deadlift2Kg,Deadlift3Kg,Best3DeadliftKg,TotalKg,Event,BirthYear,BirthDate
NS,Alexia Vandezande,F,,Raw,Juniors,,,,,,,,,,,,,,,,SBD,,
NS,Annelies Van De Velde,F,,Raw,Juniors,,,,,,,,,,,,,,,,SBD,,
NS,Noa Van Looy,F,,Raw,Juniors,,,,,,,,,,,,,,,,SBD,,
1,Mayte De Bondt,F,,Raw,Juniors,49.74,52,75,80,-82.5,80,37.5,40,42.5,42.5,105,-115,115,115,237.5,SBD,,
2,Taicha Savels,F,,Raw,Juniors,51.9,52,52.5,60,-65,60,32.5,35,-37.5,35,60,65,67.5,67.5,162.5,SBD,,
1,Floor Porters,F,,Raw,Juniors,55.5,57,105,112.5,-120,112.5,55,60,-65,60,115,122.5,130,130,302.5,SBD,,
2,Julie De Preter,F,,Raw,Juniors,55.36,57,90,-100,102.5,102.5,37.5,42.5,-45,42.5,112.5,120,-130,120,265,SBD,,
1,Jana Verwimp,F,,Raw,Juniors,61.75,63,120,127.5,135,135,70,72.5,75,75,125,132.5,-140,132.5,342.5,SBD,,
2,Aurélie Van Nuffelen,F,,Raw,Juniors,62.9,63,105,112.5,-117.5,112.5,50,55,57.5,57.5,125,135,142.5,142.5,312.5,SBD,,
3,Josien Van Biesbrouck,F,,Raw,Juniors,59.06,63,-102.5,110,115,115,50,52.5,55,55,125,132.5,140,140,310,SBD,,
4,Lorena Gonzalez Spaas,F,,Raw,Juniors,62.8,63,95,100,102.5,102.5,60,-62.5,-62.5,60,110,117.5,122.5,122.5,285,SBD,,
1,Kaya Goossens,F,,Raw,Juniors,67.35,69,132.5,140.5,145,145,65,70,72.5,72.5,150,157.5,160,160,377.5,SBD,,
2,Jana Dutordoir,F,,Raw,Juniors,66.3,69,125,-132.5,132.5,132.5,62.5,-65,65,65,147.5,157.5,165,165,362.5,SBD,,
3,Lucia Zijlstra,F,Netherlands,Raw,Juniors,65.65,69,120,127.5,135,135,62.5,65,-67.5,65,120,-130,-130,120,320,SBD,,
4,Amélie Robaey,F,,Raw,Juniors,66.45,69,105,110,-115,110,55,57.5,-60,57.5,120,127.5,132.5,132.5,300,SBD,,
1,Yente Van Meel,F,,Raw,Juniors,74.4,76,120,127.5,132.5,132.5,60,62.5,65,65,145,155,166,166,363.5,SBD,,
2,Maude Sterckx,F,,Raw,Juniors,71.05,76,120,127.5,-135,127.5,62.5,67.5,-70,67.5,140,150,155,155,350,SBD,,
3,Ellen Goorman,F,,Raw,Juniors,74.85,76,115,120,127.5,127.5,75,80,-85,80,125,132.5,142.5,142.5,350,SBD,,
4,Tine Vanduffel,F,,Raw,Juniors,72.4,76,110,120,-125,120,55,60,65,65,120,130,135,135,320,SBD,,
5,Christina Chvanova,F,,Raw,Juniors,74.75,76,115,-125,-130,115,-45,50,-55,50,120,125,132.5,132.5,297.5,SBD,,
1,Ellen Depreitere,F,,Raw,Juniors,103.75,84+,142.5,-155,162.5,162.5,60,67.5,-70,67.5,165,180,190,190,420,SBD,,
1,Evelien Artoos,F,,Raw,Masters 1,61.75,63,130,135,-145,135,57.5,-62.5,-62.5,57.5,135,145,155,155,347.5,SBD,,
1,Anne-Mieke Nuyts,F,,Raw,Masters 1,73.05,76,115,-117.5,120,120,67.5,70,-75,70,140,152.5,162.5,162.5,352.5,SBD,,
2,Katrien Adriaensens,F,,Raw,Masters 1,73.7,76,117.5,125,-130,125,60,65,-67.5,65,150,-165,,150,340,SBD,,
1,Valerie Wagemans,F,,Raw,Masters 1,78.05,84,-100,-100,100,100,45,50,-52.5,50,115,125,-135,125,275,SBD,,
2,Kim Van Rijssen,F,Netherlands,Raw,Masters 1,80.35,84,90,95,100,100,50,55,-60,55,107.5,115,120,120,275,SBD,,
NS,Laura Biesmans,F,,Raw,Open,,,,,,,,,,,,,,,,SBD,,
NS,Meggie Gengler,F,Luxembourg,Raw,Open,,,,,,,,,,,,,,,,SBD,,
1,Romy Tisson,F,,Raw,Open,45.86,47,70,75,80,80,35,37.5,40,40,82.5,88,90,90,210,SBD,,
1,Jessica Dederichs,F,,Raw,Open,51.76,52,-90,-95,95,95,47.5,52.5,-55,52.5,110,-120,,110,257.5,SBD,,
2,Alice Stinckens,F,,Raw,Open,50.96,52,75,80,-85,80,42.5,45,-47.5,45,80,85,-90,85,210,SBD,,
1,Shana Knockaert,F,,Raw,Open,56.46,57,90,102.5,-107.5,102.5,50,55,-57.5,55,115,130,-137.5,130,287.5,SBD,,
2,Kayleigh Thoen,F,,Raw,Open,53.76,57,75,80,85,85,47.5,-55,-55,47.5,102.5,110,115,115,247.5,SBD,,
1,Julie Bolle,F,,Raw,Open,61.5,63,-127.5,130,-135,130,60,65,-70,65,135,145,150,150,345,SBD,,
2,Hannah Quintyn,F,,Raw,Open,61.15,63,105,112.5,-115,112.5,65,67.5,-70,67.5,140,152.5,-160,152.5,332.5,SBD,,
1,Sahyuri Lalime,F,Belgium,Raw,Open,64.1,69,155,165,175,175,80,85,90,90,180,190,200,200,465,SBD,,
2,Rachel Mawer,F,UK,Raw,Open,65.3,69,125,135,142.5,142.5,85,90,95,95,155,165,172.5,172.5,410,SBD,,
3,Stephanie McGinnis,F,Canada,Raw,Open,67,69,145,152.5,-160,152.5,60,-65,65,65,160,172.5,-180,172.5,390,SBD,,
4,Astrid Vandijck,F,,Raw,Open,68.5,69,110,-120,-120,110,55,60,-65,60,132.5,142.5,145,145,315,SBD,,
5,Ymke Gevers,F,,Raw,Open,66.8,69,97.5,102.5,105,105,60,62.5,65,65,110,120,-130,120,290,SBD,,
6,Olina Geluykens,F,,Raw,Open,66.95,69,-110,110,-115,110,52.5,55,-57.5,55,112.5,120,125,125,290,SBD,,
7,Mirthe Parren,F,,Raw,Open,67.55,69,70,77.5,87.5,87.5,50,52.5,-55,52.5,127.5,135,142.5,142.5,282.5,SBD,,
8,Liesa Neirynck,F,,Raw,Open,66.6,69,85,-97.5,100,100,40,47.5,-50,47.5,90,102.5,-110,102.5,250,SBD,,
1,Anne-Sophie Jost,F,,Raw,Open,75,76,120,125,130,130,70,75,77.5,77.5,155,162.5,170,170,377.5,SBD,,
2,Lisa Haaren,F,,Raw,Open,74.05,76,110,122.5,127.5,127.5,55,65,67.5,67.5,155,165,170.5,170.5,365.5,SBD,,
3,Katrien Terryn,F,,Raw,Open,75.15,76,120,127.5,132.5,132.5,55,-57.5,-57.5,55,157.5,-167.5,-167.5,157.5,345,SBD,,
4,Liesbeth Van Vlasselaer,F,,Raw,Open,74.95,76,85,92.5,-100,92.5,50,-55,-55,50,100,110,115,115,257.5,SBD,,
1,Aafje Vermeiren,F,,Raw,Open,78.85,84,110,120,125,125,70,77.5,-82.5,77.5,135,142.5,150,150,352.5,SBD,,
2,Joke Vermeiren,F,,Raw,Open,81.6,84,125,132.5,-140,132.5,60,65,-70,65,130,140,145,145,342.5,SBD,,
3,Eva Van Dooren,F,,Raw,Open,80.1,84,92.5,97.5,102.5,102.5,57.5,60,-62.5,60,125,132.5,140,140,302.5,SBD,,
4,Lindsay Dekeyzer,F,,Raw,Open,82.2,84,85,92.5,97.5,97.5,-45,-45,45,45,107.5,115,-120,115,257.5,SBD,,
1,Allyson Sleeckx,F,,Raw,Open,92.1,84+,100,105,110,110,47.5,52.5,55,55,115,125,-135,125,290,SBD,,
1,Ines Ceulemans,F,,Raw,Sub-Juniors,55.56,57,-87.5,95,102.5,102.5,45,47.5,50,50,-115,120,125.5,125.5,278,SBD,,
2,Kyara Desmet,F,,Raw,Sub-Juniors,55.08,57,92.5,-100,100,100,35,37.5,-40,37.5,92.5,97.5,105,105,242.5,SBD,,
1,Chanyanut Pensuk,F,,Raw,Sub-Juniors,59.44,63,95,97.5,100,100,40,42.5,45,45,105,115,120,120,265,SBD,,
2,Marie Hermans,F,,Raw,Sub-Juniors,58.52,63,87.5,-95,-95,87.5,42.5,45,-47.5,45,90,100,105,105,237.5,SBD,,
1,Manon Casier,F,,Raw,Sub-Juniors,73,76,110,117.5,-125,117.5,47.5,52.5,55,55,132.5,141,-150,141,313.5,SBD,,
1,Alice Pizzoferrato,F,,Raw,Sub-Juniors,82.7,84,107.5,115,120,120,60,65,67.5,67.5,115,125,132.5,132.5,320,SBD,,
1,Najwa Khata,F,,Raw,Sub-Juniors,100.6,84+,-102.5,102.5,115,115,47.5,-52.5,-52.5,47.5,132.5,147.5,-150.5,147.5,310,SBD,,
1,Kathleen Compagnie,F,,Single-ply,Masters 1,66.6,69,160,170,175,175,105,-110,110,110,157.5,165.5,,165.5,450.5,SBD,,
NS,Ilya Declerck,M,,Raw,Juniors,,,,,,,,,,,,,,,,SBD,,
NS,Imad Hamich,M,,Raw,Juniors,,,,,,,,,,,,,,,,SBD,,
NS,Isak Persson,M,Sweden,Raw,Juniors,,,,,,,,,,,,,,,,SBD,,
NS,Kerian Van Den Berck,M,,Raw,Juniors,,,,,,,,,,,,,,,,SBD,,
NS,Leonard Martens,M,,Raw,Juniors,,,,,,,,,,,,,,,,SBD,,
NS,Seppe Cornille,M,,Raw,Juniors,,,,,,,,,,,,,,,,SBD,,
1,Wout Bollens,M,,Raw,Juniors,58.42,59,122.5,130.5,-133,130.5,65,70,75,75,160,-170.5,-170.5,160,365.5,SBD,,
1,Thomas Roels,M,,Raw,Juniors,64.7,66,145,152.5,160,160,115,120,125,125,145,155,165,165,450,SBD,,
2,Nick Blockmans,M,,Raw,Juniors,62.2,66,150,155,,155,105,110,,110,160,170,180,180,445,SBD,,
3,Emre-Can Duran,M,,Raw,Juniors,65.4,66,165,175,,175,-105,105,,105,75,,,75,355,SBD,,
1,Casper Schedin,M,,Raw,Juniors,72.2,74,180,190,205,205,100,110,-115,110,230,245,262.5,262.5,577.5,SBD,,
2,Michael Bernete-Diaz,M,,Raw,Juniors,71.65,74,180,195,-205,195,130,-145,150,150,200,215,225,225,570,SBD,,
3,Karsten Balcaen,M,,Raw,Juniors,73.3,74,180,187.5,195,195,105,-110,,105,210,220,-225,220,520,SBD,,
4,Ronan Beyen,M,,Raw,Juniors,73.35,74,155,165,-170,165,117.5,-127.5,-127.5,117.5,200,210,220,220,502.5,SBD,,
5,Haroen Ringoot,M,,Raw,Juniors,72.9,74,145,152.5,-160,152.5,100,107.5,-110,107.5,202.5,215,-225,215,475,SBD,,
6,Marenco Bosman,M,,Raw,Juniors,73.6,74,160,170,175,175,90,100,107.5,107.5,170,180,190,190,472.5,SBD,,
7,Bryan Soares Sousa,M,,Raw,Juniors,69.05,74,165,175,180,180,92.5,-97.5,-100,92.5,180,192.5,-210,192.5,465,SBD,,
8,Lucas Broeckx,M,,Raw,Juniors,71.7,74,155,160,165,165,95,-100,105,105,185,195,-205,195,465,SBD,,
9,Bjorn Van Den Hende,M,,Raw,Juniors,73.7,74,145,160,170,170,95,105,107.5,107.5,175,187.5,-200,187.5,465,SBD,,
10,Maxim Stepman,M,,Raw,Juniors,73.75,74,155,-165,,155,77.5,82.5,-85,82.5,212.5,227.5,,227.5,465,SBD,,
11,Yoran De Neve,M,,Raw,Juniors,73.3,74,-160,165,170,170,85,92.5,95,95,170,182.5,190,190,455,SBD,,
12,Bachir Khatibi,M,,Raw,Juniors,69.45,74,147.5,155,-162.5,155,97.5,102.5,107.5,107.5,177.5,187.5,-195,187.5,450,SBD,,
13,Nathan Moyson,M,,Raw,Juniors,72.95,74,140,152.5,-157.5,152.5,90,95,-97.5,95,190,202.5,-217.5,202.5,450,SBD,,
14,Wesley Seghers,M,,Raw,Juniors,73,74,150,157.5,165,165,92.5,102.5,105,105,150,165,180,180,450,SBD,,
15,Yorg Pauwels,M,,Raw,Juniors,71.8,74,142.5,150,157.5,157.5,92.5,95,97.5,97.5,170,-180,187.5,187.5,442.5,SBD,,
16,Ian Leadsford,M,,Raw,Juniors,68.9,74,140,147.5,-155,147.5,87.5,92.5,-100,92.5,160,175,190,190,430,SBD,,
17,Jonas Depaepe,M,,Raw,Juniors,71.7,74,115,125,132.5,132.5,-82.5,87.5,-95,87.5,135,145,155,155,375,SBD,,
DQ,Benarji Sai Mada,M,India,Raw,Juniors,67,74,-120,120,-127.5,120,-62.5,-62.5,-62.5,,125,135,150,150,,SBD,,
DQ,Andres Vermeersch,M,,Raw,Juniors,67.85,74,-140,-140,-145,,72.5,77.5,-80,77.5,190,-200,212.5,212.5,,SBD,,
DQ,Hannes Devisch,M,,Raw,Juniors,73.45,74,-165,170,-180,170,-125,-127.5,-127.5,,170,185,200,200,,SBD,,
1,Noa Hublou,M,,Raw,Juniors,80.1,83,195,205,212.5,212.5,135,140,145,145,227.5,245,,245,602.5,SBD,,
2,Gari Simonian,M,,Raw,Juniors,81.55,83,175,190,200,200,120,127.5,-132.5,127.5,205,220,230,230,557.5,SBD,,
3,Simon De Roeck,M,,Raw,Juniors,76.1,83,190,200,210,210,100,110,120,120,200,212.5,225,225,555,SBD,,
4,Tibo Cremers,M,,Raw,Juniors,81.3,83,-175,-185,185,185,110,120,122.5,122.5,225,-240,245,245,552.5,SBD,,
5,Lars Driezen,M,,Raw,Juniors,81.95,83,145,155,165,165,127.5,135,140,140,215,230,247.5,247.5,552.5,SBD,,
6,Brent Frans,M,,Raw,Juniors,81.8,83,170,-180,180,180,115,122.5,-130,122.5,225,240,,240,542.5,SBD,,
7,Detlev Bonnaerens,M,,Raw,Juniors,82.25,83,185,200,-215,200,105,110,-112.5,110,230,-250,-250,230,540,SBD,,
8,Amaro Van de Moortele,M,,Raw,Juniors,82.05,83,170,177.5,185,185,112.5,117.5,-120,117.5,220,232.5,-240,232.5,535,SBD,,
9,Arne Breemans,M,,Raw,Juniors,80.7,83,170,185,-200,185,100,107.5,-110,107.5,200,220,232.5,232.5,525,SBD,,
10,Ramzi Ziani,M,,Raw,Juniors,83,83,175,185,190,190,95,100,-102.5,100,210,225,235,235,525,SBD,,
11,Nolan Phlips,M,,Raw,Juniors,82.4,83,162.5,170,175,175,115,120,125,125,200,212.5,220,220,520,SBD,,
12,Zakaria Abouchibet Baabou,M,Spain,Raw,Juniors,82.95,83,175,185,-190,185,105,-110,112.5,112.5,200,212.5,222.5,222.5,520,SBD,,
13,Tom Zabeau,M,,Raw,Juniors,77.35,83,155,165,175,175,120,127.5,130,130,185,200,212.5,212.5,517.5,SBD,,
14,Leandro Veithen,M,,Raw,Juniors,81.25,83,145,150,160,160,110,,,110,220,-240,240,240,510,SBD,,
15,Sven Dielemans,M,,Raw,Juniors,79.6,83,160,170,180,180,97.5,107.5,112.5,112.5,190,202.5,-215,202.5,495,SBD,,
16,Jo Huymans,M,,Raw,Juniors,81.8,83,155,-167.5,167.5,167.5,110,117.5,-125,117.5,175,190,205,205,490,SBD,,
17,Mathias Peters,M,,Raw,Juniors,80.7,83,160,170,-175,170,115,-120,-120,115,170,190,-205,190,475,SBD,,
18,Casper Joosten,M,,Raw,Juniors,81.8,83,155,165,-175,165,110,120,125,125,165,177.5,185,185,475,SBD,,
19,Niel Moons,M,,Raw,Juniors,82.2,83,170,-177.5,-182.5,170,-100,100,105,105,175,192.5,-215,192.5,467.5,SBD,,
20,Rik De Grauwe,M,,Raw,Juniors,81.4,83,150,,,150,152.5,165.5,-170,165.5,150,,,150,465.5,SBD,,
21,Bart Sutens,M,,Raw,Juniors,79.35,83,-145,152.5,160,160,115,125,-130,125,170,180,-182.5,180,465,SBD,,
22,Jasper Jordens,M,,Raw,Juniors,77.55,83,160,167.5,-172.5,167.5,100,105,-110,105,175,187.5,-190,187.5,460,SBD,,
23,Gianni Verbrugghe,M,,Raw,Juniors,82.4,83,155,165,175,175,67.5,72.5,77.5,77.5,175,190,-205,190,442.5,SBD,,
24,Yannick Hens,M,,Raw,Juniors,82.4,83,140,150,-157.5,150,90,95,100,100,165,175,-182.5,175,425,SBD,,
25,Michael Pauwels,M,,Raw,Juniors,79.75,83,125,132.5,135,135,95,100,105,105,155,165,170,170,410,SBD,,
26,Louka Konings,M,,Raw,Juniors,78.75,83,120,130,140,140,85,92.5,-97.5,92.5,155,167.5,-180,167.5,400,SBD,,
27,Guillaume Renty,M,,Raw,Juniors,80.6,83,132.5,140,-150,140,80,85,-90,85,140,155,-170,155,380,SBD,,
1,Enes Dogru,M,,Raw,Juniors,91.4,93,220,230,-240,230,160,-167.5,-167.5,160,-210,215,232.5,232.5,622.5,SBD,,
2,Tycho Dehouck,M,,Raw,Juniors,88.5,93,190,200,210,210,-125,135,140,140,240,257.5,270,270,620,SBD,,
3,Michiel Heremans,M,,Raw,Juniors,91.15,93,205,215,220,220,-115,120,-125,120,260,280,-290,280,620,SBD,,
4,Jens De Maeseneer,M,,Raw,Juniors,90.15,93,170,182.5,187.5,187.5,130,135,140,140,225,240,250,250,577.5,SBD,,
5,Robbe Berten Stein,M,,Raw,Juniors,90.7,93,180,195,200,200,-110,115,120,120,230,-245,255,255,575,SBD,,
6,Freek Herregods,M,,Raw,Juniors,88.6,93,170,180,190,190,115,122.5,130,130,215,230,245,245,565,SBD,,
7,Michiel Sutens,M,,Raw,Juniors,90.6,93,160,167.5,172.5,172.5,130,140,-150,140,210,220,227.5,227.5,540,SBD,,
8,Islam Balaev,M,,Raw,Juniors,91.5,93,190,200,-205,200,110,115,-117.5,115,-200,205,220,220,535,SBD,,
9,Nicolas De Roover,M,,Raw,Juniors,91.95,93,170,180,-185,180,125,130,135,135,200,210,220,220,535,SBD,,
10,Leyton Soenens,M,,Raw,Juniors,84.4,93,165,177.5,185,185,122.5,-127.5,127.5,127.5,195,207.5,217.5,217.5,530,SBD,,
11,Maxim Van Audenhove,M,,Raw,Juniors,87.8,93,180,187.5,192.5,192.5,-100,110,-120,110,-200,220,-230,220,522.5,SBD,,
12,Caïn Van Rode,M,,Raw,Juniors,92.25,93,165,172.5,-175,172.5,120,127.5,-132.5,127.5,205,220,-230,220,520,SBD,,
13,Jarne Anthonis,M,,Raw,Juniors,89.25,93,165,175,185,185,115,122.5,-125,122.5,190,202.5,-212.5,202.5,510,SBD,,
14,Wout Vandermeulen,M,,Raw,Juniors,90.85,93,165,180,-190,180,100,107.5,-112.5,107.5,210,220,-232.5,220,507.5,SBD,,
15,Lucas De Wever,M,,Raw,Juniors,85.75,93,-157.5,162.5,170,170,102.5,110,117.5,117.5,160,172.5,187.5,187.5,475,SBD,,
16,Simon De Lange,M,,Raw,Juniors,84.75,93,-137.5,140,147.5,147.5,110,117.5,122.5,122.5,180,195,-200,195,465,SBD,,
1,Senne Briesen,M,,Raw,Juniors,99.8,105,-195,205,212.5,212.5,135,-142.5,142.5,142.5,215,-227.5,245,245,600,SBD,,
2,Robbert Mahieu,M,,Raw,Juniors,98,105,180,192.5,202.5,202.5,120,-130,130,130,205,217.5,232.5,232.5,565,SBD,,
3,Mika Van Kerckhove,M,,Raw,Juniors,96.7,105,195,200,205,205,110,115,117.5,117.5,220,230,240,240,562.5,SBD,,
4,Loïc Verbeke,M,,Raw,Juniors,101.75,105,180,190,195,195,120,125,-127.5,125,215,230,240,240,560,SBD,,
5,Brecht Van Wynsberge,M,,Raw,Juniors,101.95,105,-195,195,-205,195,125,132.5,-137.5,132.5,200,222.5,-230,222.5,550,SBD,,
6,Sam Groen,M,,Raw,Juniors,101.4,105,160,-172.5,172.5,172.5,110,120,-127.5,120,180,200,210,210,502.5,SBD,,
7,Niels Ceuppens,M,,Raw,Juniors,98.05,105,25,,,25,25,,,25,75,,,75,125,SBD,,
1,Giel Hendriks,M,,Raw,Juniors,116.9,120,180,197.5,215,215,120,-132.5,-132.5,120,210,230,-250,230,565,SBD,,
2,Ashley Marsh,M,,Raw,Juniors,109.75,120,132.5,-140,140,140,77.5,82.5,85,85,200,-205,210,210,435,SBD,,
1,Kristiaan Ten,M,,Raw,Juniors,134.4,120+,240,260.5,275,275,125,135,142.5,142.5,220,,,220,637.5,SBD,,
1,Nico Verheyden,M,,Raw,Masters 1,81.4,83,-125,125,135,135,100,-107.5,-107.5,100,175,185,-190,185,420,SBD,,
2,Tom De Cock,M,,Raw,Masters 1,75.45,83,90,100,-105,100,70,-75,-75,70,140,147.5,155,155,325,SBD,,
DQ,Kevin Van Parys,M,,Raw,Masters 1,92.7,93,190,-200,200,200,-125,-125,-125,,200,210,-222.5,210,,SBD,,
1,Richard Hogg,M,,Raw,Masters 1,101.95,105,145,155,162.5,162.5,105,110,-112.5,110,185,187.5,-200,187.5,460,SBD,,
2,Steven Ceuppens,M,,Raw,Masters 1,104.9,105,-140,150,165,165,80,90,-95,90,165,180,200,200,455,SBD,,
3,Bart Potters,M,,Raw,Masters 1,104.9,105,140,145,147.5,147.5,102.5,-105,-105,102.5,170,175,-177.5,175,425,SBD,,
1,Joris De Saedeleer,M,,Raw,Masters 1,111,120,-215,230,-235,230,135,140,147.5,147.5,230,247.5,260,260,637.5,SBD,,
2,Allen Rudd,M,Australia,Raw,Masters 1,116.8,120,155,165,172.5,172.5,140,147.5,-152.5,147.5,200,215,225,225,545,SBD,,
3,Björn Vandenheede,M,,Raw,Masters 1,107.25,120,175,180,185,185,120,127.5,-130,127.5,195,205,215,215,527.5,SBD,,
1,Orhan Bilican,M,,Raw,Masters 1,127.4,120+,270,320,342.5,342.5,170,,,170,270,,,270,782.5,SBD,,
1,Dirk Verbruggen,M,,Raw,Masters 2,63.85,66,120,130,140,140,70,75,80,80,140,165,,165,385,SBD,,
1,Alain Neyt,M,,Raw,Masters 2,104,105,165,175,185,185,157.5,162.5,167.5,167.5,190,205,212.5,212.5,565,SBD,,
NS,Brent Vanhees,M,,Raw,Open,,,,,,,,,,,,,,,,SBD,,
NS,Ilya Declerck,M,,Raw,Open,,,,,,,,,,,,,,,,SBD,,
NS,Isak Persson,M,Sweden,Raw,Open,,,,,,,,,,,,,,,,SBD,,
NS,Jonas De Seins,M,,Raw,Open,,,,,,,,,,,,,,,,SBD,,
NS,Jasper Vanhoutte,M,,Raw,Open,,,,,,,,,,,,,,,,SBD,,
NS,Kerian Van Den Berck,M,,Raw,Open,,,,,,,,,,,,,,,,SBD,,
NS,Kevin Hellemans,M,,Raw,Open,,,,,,,,,,,,,,,,SBD,,
NS,Leonard Martens,M,,Raw,Open,,,,,,,,,,,,,,,,SBD,,
NS,Louis Lambrecht,M,,Raw,Open,,,,,,,,,,,,,,,,SBD,,
NS,Nick Anthonissens,M,,Raw,Open,,,,,,,,,,,,,,,,SBD,,
NS,Seppe Cornille,M,,Raw,Open,,,,,,,,,,,,,,,,SBD,,
1,Hans Van der Staak,M,,Raw,Open,64.5,66,150,-160,-160,150,105,110,115,115,195,207.5,212.5,212.5,477.5,SBD,,
2,Alexander Janssen,M,,Raw,Open,65.75,66,150,-160,-160,150,102.5,107.5,-112.5,107.5,-202.5,202.5,-210,202.5,460,SBD,,
3,Pieter De Bruyn,M,,Raw,Open,65.8,66,97.5,105,112.5,112.5,72.5,77.5,82.5,82.5,130,140,-150,140,335,SBD,,
1,Gilles De Peuter,M,,Raw,Open,73.7,74,220,-230.5,-230.5,220,92.5,95,-97.5,95,242.5,271.5,,271.5,586.5,SBD,,
2,Jorne Feijaerts,M,,Raw,Open,73.6,74,175,185,192.5,192.5,110,115,-120,115,235,247.5,-255,247.5,555,SBD,,
3,Lukas Demey,M,,Raw,Open,72.85,74,185,195,-205,195,130,-135,-135,130,-215,215,-225,215,540,SBD,,
4,Michiel Foriers,M,,Raw,Open,72.35,74,155,160,165,165,100,110,-112.5,110,225,240,250,250,525,SBD,,
5,Lars Leenders,M,,Raw,Open,71.8,74,185,-195,-195,185,145,150,-155,150,165,175,185,185,520,SBD,,
6,Dimas De Ridder,M,,Raw,Open,73,74,-182.5,-187.5,187.5,187.5,100,105,-107.5,105,200,210,-227.5,210,502.5,SBD,,
7,Lawrence Timmermans,M,,Raw,Open,73.2,74,150,160,167.5,167.5,90,100,-105,100,165,177.5,-190,177.5,445,SBD,,
8,Olivier Lannoo,M,,Raw,Open,73.6,74,130,137.5,-142.5,137.5,75,82.5,-85,82.5,-160,170,-180,170,390,SBD,,
1,Furkan Bilican,M,,Raw,Open,81.4,83,205,220,-230,220,135,142.5,147.5,147.5,225,-235,245,245,612.5,SBD,,
2,Pieter Van Der Linden,M,,Raw,Open,82.5,83,205,220,-237.5,220,130,-137.5,,130,250,-280,-280,250,600,SBD,,
3,Chiel Van Den Heuvel,M,,Raw,Open,81.9,83,170,180,190,190,140,145,150,150,230,240,-245,240,580,SBD,,
4,Tom Van Delm,M,,Raw,Open,82.75,83,187.5,200,207.5,207.5,110,117.5,-120,117.5,225,245,252.5,252.5,577.5,SBD,,
5,Sam Clemens,M,,Raw,Open,81.65,83,190,197.5,205,205,110,-117.5,117.5,117.5,200,212.5,220,220,542.5,SBD,,
6,Ian Hesbeens,M,,Raw,Open,81.45,83,180,192.5,-197.5,192.5,115,122.5,127.5,127.5,205,-217.5,220,220,540,SBD,,
7,Stijn Vanheste,M,,Raw,Open,80.2,83,190,200,-205,200,105,-110,,105,220,232.5,-237.5,232.5,537.5,SBD,,
8,Jasper Pessemier,M,,Raw,Open,82.35,83,170,180,185,185,120,125,-127.5,125,210,220,-225,220,530,SBD,,
9,Kamil Wejman,M,Poland,Raw,Open,77.15,83,-165,165,175,175,-120,120,122.5,122.5,190,200,210,210,507.5,SBD,,
10,Tom Van Hove,M,,Raw,Open,81.95,83,-180,-180,180,180,112.5,120,-125,120,182.5,192.5,-202.5,192.5,492.5,SBD,,
11,Maxime Klapholz,M,,Raw,Open,81.95,83,142.5,152.5,-160,152.5,-100,105,-110,105,190,200,-210,200,457.5,SBD,,
12,Peiyang Huo,M,Canada,Raw,Open,81.95,83,147.5,157.5,162.5,162.5,95,102.5,105,105,165,175,190,190,457.5,SBD,,
1,Bert Boydens,M,,Raw,Open,92.5,93,230,245,255,255,135,145,150,150,280,292.5,300,300,705,SBD,,
2,Colin Smith,M,,Raw,Open,92.7,93,230,245,260,260,120,,,120,240,265,285,285,665,SBD,,
3,Mo Van der Hallen,M,,Raw,Open,91.85,93,210,230,-235,230,120,130,,130,240,262.5,270,270,630,SBD,,
4,Stefan Veressen,M,,Raw,Open,92.9,93,190,202.5,210,210,115,122.5,-127.5,122.5,230,242.5,252.5,252.5,585,SBD,,
5,Matthias Vandaele,M,,Raw,Open,91.95,93,195,205,210,210,125,135,-140,135,215,235,-240,235,580,SBD,,
6,Bart Ceunen,M,,Raw,Open,92.45,93,180,190,197.5,197.5,130,135,140,140,215,-230,235,235,572.5,SBD,,
7,Kadir Kartal,M,,Raw,Open,91,93,195,-205,210,210,107.5,-112.5,115,115,225,235,242.5,242.5,567.5,SBD,,
8,Bjorn Notermans,M,Netherlands,Raw,Open,92.35,93,175,185,192.5,192.5,120,-127.5,-127.5,120,207.5,220,-230,220,532.5,SBD,,
9,Andrew Rubinstein,M,,Raw,Open,91.85,93,75,,,75,160,165,170,170,75,,,75,320,SBD,,
DQ,Dennis Louagie,M,,Raw,Open,92.5,93,195,205,-210,205,-130,-130,-130,,225,250,-265,250,,SBD,,
1,Jeroen Verschueure,M,,Raw,Open,100.6,105,220,235,-250,235,145,160,-165,160,260,280,290,290,685,SBD,,
2,Jonathan Delombaerde,M,,Raw,Open,102.6,105,225,240,250,250,140,150,157.5,157.5,250,270,-290,270,677.5,SBD,,
3,Timo Herrmann,M,Germany,Raw,Open,103.2,105,195,205,-210,205,150,157.5,162.5,162.5,252.5,272.5,-280,272.5,640,SBD,,
4,Koen Sels,M,,Raw,Open,104.75,105,217.5,230,240,240,115,122.5,-127.5,122.5,235,255,-275,255,617.5,SBD,,
5,Niels Boermans,M,,Raw,Open,100.15,105,195,205,210,210,157.5,165,-172.5,165,215,227.5,240,240,615,SBD,,
6,Andy Beliën,M,,Raw,Open,104.4,105,195,210,220,220,135,145,-150,145,215,240,250,250,615,SBD,,
7,Matthias Hensen,M,,Raw,Open,102.7,105,-210,220,-225,220,130,-135,-137.5,130,225,240,252.5,252.5,602.5,SBD,,
8,Malik Adriaens,M,,Raw,Open,101.6,105,180,190,200,200,137.5,145,150,150,227.5,240,250,250,600,SBD,,
9,Simon Rheel,M,,Raw,Open,100.8,105,-192.5,192.5,205,205,122.5,130,132.5,132.5,227.5,240,250,250,587.5,SBD,,
10,Yarni D'Haeseleer,M,,Raw,Open,102.15,105,195,202.5,210,210,115,122.5,-127.5,122.5,225,242.5,255,255,587.5,SBD,,
11,Tom Debaes,M,,Raw,Open,104,105,205,220,230,230,95,-110,-110,95,235,255,-275,255,580,SBD,,
12,Jaime Cuypers,M,,Raw,Open,103.25,105,180,192.5,200,200,105,115,120,120,230,240,-245,240,560,SBD,,
13,Bram Breda,M,,Raw,Open,102.6,105,180,190,197.5,197.5,102.5,107.5,-112.5,107.5,220,235,-245,235,540,SBD,,
14,Thomas Reniers,M,,Raw,Open,96.35,105,145,155,165,165,120,-127.5,-132.5,120,200,215,230,230,515,SBD,,
15,Axel Faes,M,,Raw,Open,94.3,105,165,-172.5,175,175,115,120,-125,120,190,200,210,210,505,SBD,,
16,Manu Vanmeerbeek,M,,Raw,Open,98.1,105,140,150,160,160,-117.5,-125,125,125,182.5,195,-200,195,480,SBD,,
17,Nathan Decoster,M,,Raw,Open,101.4,105,-155,155,165,165,95,-100,100,100,200,212.5,-225,212.5,477.5,SBD,,
18,Bleach Van Hooydonck,M,,Raw,Open,103.2,105,145,155,165,165,90,97.5,-102.5,97.5,170,182.5,195,195,457.5,SBD,,
19,Ruben De Laet,M,,Raw,Open,94.45,105,142.5,152.5,155,155,97.5,105,-110,105,160,175,190,190,450,SBD,,
1,Jochen Strubbe,M,,Raw,Open,106.6,120,262.5,280,285,285,187.5,-190,,187.5,290,315,327.5,327.5,800,SBD,,
2,Maarten Luyts,M,,Raw,Open,112.85,120,160,172.5,180,180,120,127.5,130,130,180,200,215,215,525,SBD,,
DQ,Louis Van Tonder,M,,Raw,Open,117.7,120,-225,-225,-230,,145,-152.5,,145,265,-280,-280,265,,SBD,,
1,Steve Ringoot,M,,Raw,Open,149.8,120+,300,320,330,330,210,222.5,230,230,300,320,330,330,890,SBD,,
2,Glenn Nys,M,,Raw,Open,121.3,120+,245,260,270,270,180,190,-200,190,305,320,330,330,790,SBD,,
NS,Isak Persson,M,Sweden,Raw,Sub-Juniors,,,,,,,,,,,,,,,,SBD,,
NS,Leonard Martens,M,,Raw,Sub-Juniors,,,,,,,,,,,,,,,,SBD,,
1,Zico Van Gorp,M,,Raw,Sub-Juniors,66,66,152.5,160,-165,160,97.5,105,-110,105,170,177.5,185,185,450,SBD,,
2,Rémi Kindt,M,,Raw,Sub-Juniors,65.5,66,105,117.5,125,125,70,75,-82.5,75,125,137.5,145,145,345,SBD,,
3,Laurens Van Bouwel,M,,Raw,Sub-Juniors,59.88,66,90,95,100,100,50,55,-60,55,105,115,-125,115,270,SBD,,
1,Thomas Boucquez,M,,Raw,Sub-Juniors,70.65,74,120,130,140,140,72.5,77.5,82.5,82.5,177.5,-190,197.5,197.5,420,SBD,,
1,Yanis Boujoubou,M,,Raw,Sub-Juniors,76.15,83,-200.5,212.5,225,225,120,125,-130,125,200,210,-220,210,560,SBD,,
2,Jaden Demeester,M,,Raw,Sub-Juniors,80.45,83,150,160,170,170,105,115,-120,115,180,192.5,200,200,485,SBD,,
3,Tim Hubrechts,M,,Raw,Sub-Juniors,82.2,83,165,177.5,180,180,95,102.5,107.5,107.5,175,187.5,197.5,197.5,485,SBD,,
4,Tarik Yalcin,M,Turkey,Raw,Sub-Juniors,76.25,83,160,165,172.5,172.5,100,107.5,112.5,112.5,180,190,-200,190,475,SBD,,
5,Sebastiaan Huveneers,M,,Raw,Sub-Juniors,78.3,83,140,150,-155,150,95,100,105,105,180,195,210,210,465,SBD,,
6,Samil Gulec,M,,Raw,Sub-Juniors,80.55,83,155,162.5,165,165,105,112.5,-115,112.5,160,172.5,182.5,182.5,460,SBD,,
7,Simon Ceuppens,M,,Raw,Sub-Juniors,75.1,83,135,142.5,150,150,105,-110,110,110,175,190,-200,190,450,SBD,,
8,Francis De Ridder,M,,Raw,Sub-Juniors,76.95,83,125,135,140,140,75,80,-82.5,80,160,170,177.5,177.5,397.5,SBD,,
9,Matteo Hutse,M,,Raw,Sub-Juniors,81.3,83,75,,,75,95,105,112.5,112.5,75,,,75,262.5,SBD,,
1,Kenji Borremans,M,,Raw,Sub-Juniors,91.35,93,205,220,-241,220,150,160,165,165,225,240,253,253,638,SBD,,
2,Amine Tazi,M,,Raw,Sub-Juniors,85.35,93,195,205,215,215,110,120,127.5,127.5,210,215,-220,215,557.5,SBD,,
3,Tijl Cresens,M,,Raw,Sub-Juniors,90.85,93,122.5,127.5,135,135,122.5,130,135,135,180,190,205,205,475,SBD,,
4,Kasper Verschueren,M,,Raw,Sub-Juniors,91.6,93,150,160,167.5,167.5,95,105,110,110,185,197.5,-205,197.5,475,SBD,,
5,Robbe Noyens,M,,Raw,Sub-Juniors,91.85,93,132.5,140,145,145,90,95,-97.5,95,162.5,-170,170,170,410,SBD,,
1,Nathaniel Fernandez,M,,Raw,Sub-Juniors,96.6,105,170,185,200,200,100,107.5,-112.5,107.5,200,215,230,230,537.5,SBD,,
2,Sybe Oris,M,,Raw,Sub-Juniors,97.45,105,165,172.5,180,180,102.5,107.5,-112.5,107.5,180,190,200,200,487.5,SBD,,
1,Jean-Marc De Ro,M,,Single-ply,Masters 2,89.25,93,100,,,100,100,,,100,100,,,100,300,SBD,,
1,Lieven De Saedeleer,M,,Single-ply,Open,103,105,310,317.5,,317.5,252.5,-255,-255,252.5,255,270,-280,270,840,SBD,,
2,Rob Laethem,M,,Single-ply,Open,99.35,105,260,270,-275,270,175,182.5,187.5,187.5,217.5,230,242.5,242.5,700,SBD,,
DQ,Jonas Vandevelde,M,,Single-ply,Sub-Juniors,58.84,59,95,105,-112.5,105,-65,-65,-65,,140,-160,-160,140,,SBD,,
1,Mathieu Bogemans,M,,Raw,Juniors,77.05,83,,,,,-85,85,-90,85,,,,,85,B,,
NS,Yannis Van Laere,M,,Raw,Open,,,,,,,,,,,,,,,,B,,
1,Reinout De Saedeleer,M,,Raw,Open,92.5,93,,,,,140,-145,-145,140,,,,,140,B,,
1,Wouter De Saedeleer,M,,Raw,Open,117.2,120,,,,,207.5,215,-222.5,215,,,,,215,B,,
2,Alan Peeters,M,,Raw,Open,119.55,120,,,,,185,200,210,210,,,,,210,B,,
