Datetime|Method|Username|Password|IPAddress|URL|ResponseCode|ResponseBody|UA|Error|
2020/03/09 11:12:00|Accountlogon|0914284883|1234|127.0.0.1|http://10.104.140.72:444/mCoA/services/RadiusDynAuthPort?wsdl|200|{"allowToAddMac":["false"],"callingStationId":[""],"ipAddress":["127.0.0.1"],"logonStatus":["false"],"replyMessage":["No valid Session"],"responseCode":["0000"],"responseMessage":["REQUEST_SUCCESS"],"unlimitedAccount":["false"]}|Mozilla/5.0 (Windows NT 10.0; WOW64; rv:58.0) Gecko/20100101 Firefox/58.0|
2020/03/09 11:13:44|Accountlogon|0914284883|1111|127.0.0.1|http://10.104.140.72:444/mCoA/services/RadiusDynAuthPort?wsdl|200|{"allowToAddMac":["false"],"callingStationId":[""],"ipAddress":["127.0.0.1"],"logonStatus":["false"],"replyMessage":["No valid Session"],"responseCode":["0000"],"responseMessage":["REQUEST_SUCCESS"],"unlimitedAccount":["false"]}|Mozilla/5.0 (Windows NT 10.0; WOW64; rv:58.0) Gecko/20100101 Firefox/58.0|
2020/03/09 11:15:20|Accountlogon|0914284883|5555|127.0.0.1|http://10.104.140.72:444/mCoA/services/RadiusDynAuthPort?wsdl|200|{"allowToAddMac":["false"],"callingStationId":[""],"ipAddress":["127.0.0.1"],"logonStatus":["false"],"replyMessage":["No valid Session"],"responseCode":["0000"],"responseMessage":["REQUEST_SUCCESS"],"unlimitedAccount":["false"]}|Mozilla/5.0 (Windows NT 10.0; WOW64; rv:58.0) Gecko/20100101 Firefox/58.0|
2020/03/09 11:16:29|Accountlogon|0914284883|5555|127.0.0.1|http://10.104.140.72:444/mCoA/services/RadiusDynAuthPort?wsdl|200|{"allowToAddMac":["false"],"callingStationId":[""],"ipAddress":["127.0.0.1"],"logonStatus":["false"],"replyMessage":["No valid Session"],"responseCode":["0000"],"responseMessage":["REQUEST_SUCCESS"],"unlimitedAccount":["false"]}|Mozilla/5.0 (Windows NT 10.0; WOW64; rv:58.0) Gecko/20100101 Firefox/58.0|
