{
    "arduino.idePath": "C:\\Program Files (x86)\\Arduino",
    "arduino.serialPort": "COM7",
    "arduino.libraryPath": "C:\\Users\\ezsil\\Documents\\Arduino\\libraries",
    "arduino.fqbn": "arduino:avr:mega:cpu=atmega2560",
    "arduino.baudrate": 115200,
    "arduino.verbose": true,
    "arduino.compileOptions": "-verbose",
    "arduino.partno": "atmega2560",
    "arduino.programmer": "wiring",

    //"cppcheck.enable": true,
    //"cppcheck.cppcheckPath": "/usr/local/bin/",
    
    "editor.formatOnType": true,
    "files.associations": {
        "ios": "cpp",
        "xiosbase": "cpp"
    }
    //"include-autocomplete.extensions": [
    //    "",
    //    ".h",
    //    ".hpp",
    //    ".hxx",
    //    ".ino"
    //]
}