<svg xmlns="http://www.w3.org/2000/svg" style="enable-background:new 0 0 134.7 130.4" xml:space="preserve" viewBox="0 0 134.7 130.4">
  <path d="M134.5 60.5C132 26.7 102.8 0 67.3 0 30.2 0 0 29.2 0 65.2s30.2 65.2 67.3 65.2c4 0 7.9-.4 11.7-1 31.6-5.4 55.7-32.1 55.7-64.2 0-1.6-.1-3.2-.2-4.7z" style="fill:#5578f8"/>
  <path d="M60.1 81.7c-1.2-.1-2.3-.3-3.5-.4-7-.9-16.2-2.5-24.2-6.6-4.6-2.3-7.6-5.1-8.8-8.1-1.6-4.1 0-8.5 1.1-10.8 2.7-5.3 6.9-9.7 12-12.7 5.3-3 11-5.1 17.1-6.3 11.3-2.4 22.9-2.9 34.4-1.4 8.9 1.1 15.4 3 20.6 6.2 1.6 1 6.9 4.5 6.7 9.3-.2 4.2-4.5 7.2-7.1 8.6-5.5 3.1-12.2 5-20.8 5.9-10.1 1.1-18.4.4-25.3-2.2-3.1-1.2-5-2.7-5.4-4.4-.5-2.1 1.1-4.7 3-6.2 2.6-2.1 6.2-3.5 10.8-4.2 5.3-.8 10.7-.7 15.9.4h.1c1.4.2 2.8.8 4 1.6.8.6 1.2 1.6 1 2.5-.4 1-2 1.7-3.3 2-4.1 1-7.9.6-12.3.1h-.4c-1.1-.1-2.2.7-2.3 1.8-.1 1.1.7 2.2 1.8 2.3h.4c4.6.5 9 1.1 13.8-.2 3.4-.9 5.5-2.5 6.3-4.8v-.2c.6-2.6-.4-5.3-2.5-6.9-1.7-1.2-3.7-2-5.7-2.4-5.7-1.2-11.6-1.3-17.3-.4-5.3.8-9.5 2.5-12.7 5-3 2.4-5.5 6.5-4.5 10.5.8 3.1 3.5 5.6 7.9 7.2 7.6 2.9 16.5 3.7 27.3 2.5 9.2-1 16.3-3.1 22.4-6.4 5.7-3.2 9-7.4 9.2-12 .2-4.8-2.9-9.5-8.7-13-5.7-3.5-12.8-5.6-22.2-6.7-12-1.5-24-1-35.7 1.5-6.4 1.3-12.6 3.5-18.3 6.8C28.8 43 24.1 47.9 21 54c-1.6 3.3-2.3 6.7-2.1 9.8-.1 0-.2.1-.2.2.1 5.4.9 30.4 8.2 45.8 10.8 9.1 25 14.7 40.4 14.7 33.4 0 60.6-25.8 61.4-57.8-7.7 6.5-23.7 15.2-54.2 15.5-5.3.1-10-.1-14.4-.5z" style="fill:#fff"/>
</svg>
