<?xml version="1.0" encoding="utf-8"?>
<!-- Generator: Adobe Illustrator 23.0.1, SVG Export Plug-In . SVG Version: 6.00 Build 0)  -->
<svg version="1.1" id="Capa_2" xmlns="http://www.w3.org/2000/svg" xmlns:xlink="http://www.w3.org/1999/xlink" x="0px" y="0px"
	 viewBox="0 0 320.6 66" style="enable-background:new 0 0 320.6 66;" xml:space="preserve">
<style type="text/css">
	.st0{fill:#B5A99D;}
	.st1{stroke:#FFFFFF;stroke-miterlimit:10;}
	.st2{fill:none;}
	.st3{fill:#444444;}
	.st4{fill:#F2F2F2;}
	.st5{fill:none;stroke:#B5A99D;stroke-width:2;stroke-miterlimit:10;}
</style>
<g>
	<path class="st0" d="M314.4,66H5.7c-3.4,0-6.2-2.8-6.2-6.2V6.2C-0.4,2.8,2.3,0,5.7,0h308.7c3.4,0,6.2,2.8,6.2,6.2v53.7
		C320.6,63.2,317.8,66,314.4,66z M5.7,2C3.4,2,1.6,3.9,1.6,6.2v53.7c0,2.3,1.9,4.2,4.2,4.2h308.7c2.3,0,4.2-1.9,4.2-4.2V6.2
		c0-2.3-1.9-4.2-4.2-4.2H5.7z"/>
</g>
<path class="st2" d="M44.1,29.9C44.1,29.9,44,29.9,44.1,29.9C44,29.9,44.1,29.9,44.1,29.9z"/>
<g>
	<path class="st0" d="M59.1,45.6c-5.5-2.6-10.9-7-14.5-11.9c-4.3-5.8-4.7-10.2-4.7-11.4c0-1,3.1-4.3,6.7-6.9c3.2-2.2,7.4-4,8.7-4
		c1.5,0,7.4,1.8,11.3,4.7c3.6,2.6,5.4,6.4,5.4,6.8c0,0.8-0.6,2.9-2.9,5c-3,2.7-9.2,5.7-21.6,4.5c-0.6,0.2-1,0.6-1,0.7
		c2.5,4.4,12.9,11.6,14.7,11.6c1.8,0,10.5-3.3,16.1-9c4.8-5,6.8-12.5,6.5-13.3c-0.3-0.5-5.4-4.4-11.6-7.7
		c-5.8-3.1-11.8-5.2-14.9-5.2c-1.9,0-9.7,2-14.9,4.5c-7.3,3.6-12.6,8.3-12.9,9.6c-0.5,2.2,2.1,8,7.7,12.7
		C43.9,42,53.3,45.9,59.1,45.6C59.1,45.6,59.1,45.6,59.1,45.6z"/>
	<path class="st0" d="M84.4,27.2c-0.1,0.1-0.1,0.3-0.2,0.5C83.4,29.5,81,35,76.5,39c-5.5,4.9-13,7.5-14.6,7.9
		c-2.7,0.7-12.4-0.5-18.6-4c-6.5-3.6-11.4-9-12.6-10.6c-1.6-2.2-2.4-3.9-2.6-4.5C28,28,27.7,28.4,27.4,29c-0.3,1.3,6,19.5,7.2,20.9
		c1.7,1.8,17.5,6.4,22,6.4c6.6,0,17.5-4.5,18.7-5.5c1.8-1.6,9.3-20.4,9.3-21.9C84.7,28.2,84.5,27.5,84.4,27.2z"/>
	<path class="st0" d="M49.2,26.5c-0.7-0.7-1.7-3.7-1.3-4.6c0.4-1,3.6-3.8,5-4.8c0.4-0.3,1.5,0.1,1.7,0.2l0.2,0.1l0,0.3l0,0.2
		L54.5,18c-1.3,0.5-3.9,3-3.9,3.8c0,0.5,1.4,3,1.7,3.3c2.4,1.2,14.8-0.1,16.5-1.8c0.2-0.3,0.2-2.4,0-2.8c-0.3-0.4-2.7-2.7-5.8-4.5
		c-2.9-1.7-6.4-2.6-7.7-2.6c-2.5,0-13.4,7.1-13.4,8.8c0,1.9,3.2,7.6,4.4,8.2c1.1,0.6,10.2,0.9,15.6-0.4c5.1-1.2,7.7-4.9,8.2-5.7
		c0,0,0,0,0-0.1C65.2,28.3,50,27.4,49.2,26.5z"/>
</g>
<g>
	<g>
		<path class="st3" d="M126.9,19.2V46h-7.4V33l-5.4,6.1H112l-5.4-6.1v13h-7.4V19.2h2.6l11.3,11.4l11.3-11.4H126.9z"/>
		<path class="st3" d="M157.5,19.5v16c0,2.3-0.5,4.3-1.6,5.9c-1.1,1.7-2.5,2.9-4.3,3.8c-1.8,0.9-3.8,1.3-6,1.3c-2.2,0-4.2-0.4-6-1.3
			c-1.8-0.9-3.3-2.1-4.3-3.8c-1.1-1.7-1.6-3.6-1.6-5.9v-16h7.4V35c0,1.4,0.4,2.5,1.1,3.4c0.7,0.9,1.9,1.3,3.5,1.3s2.7-0.5,3.5-1.3
			c0.7-0.9,1.1-2,1.1-3.3V19.5H157.5z"/>
		<path class="st3" d="M188.3,19.6v26.8h-2.6L171.6,33v13h-7.4V19.2h2.6L181,32.8V19.6H188.3z"/>
		<path class="st3" d="M206.7,19.6c1.3,0,2.6,0.2,3.9,0.6c1.3,0.4,2.4,0.9,3.4,1.7s1.8,1.7,2.5,2.9c0.6,1.2,0.9,2.5,0.9,4.1
			c0,2-0.6,3.6-1.7,4.9s-2.5,2.2-4.3,2.6l7.3,9.7h-9l-7.1-10.5V46h-7.4V19.6H206.7z M202.8,26.5v4.9c0.4,0.2,0.9,0.3,1.4,0.4
			c0.5,0.1,1.1,0.2,1.6,0.2c1.2,0,2.1-0.2,2.9-0.7c0.8-0.5,1.2-1.2,1.2-2.1c0-1.1-0.4-1.8-1.2-2.1c-0.8-0.4-1.7-0.5-2.9-0.5H202.8z"
			/>
		<path class="st3" d="M233.1,19c1.8,0,3.5,0.3,5.1,0.9c1.6,0.6,3.1,1.5,4.4,2.7c1.3,1.2,2.3,2.6,3.1,4.3c0.7,1.7,1.1,3.7,1.1,5.8
			c0,2.2-0.4,4.1-1.1,5.8c-0.7,1.7-1.8,3.2-3.1,4.3c-1.3,1.2-2.8,2.1-4.4,2.7s-3.4,0.9-5.1,0.9s-3.5-0.3-5.1-0.9s-3.1-1.5-4.4-2.7
			c-1.3-1.2-2.3-2.6-3.1-4.3c-0.7-1.7-1.1-3.7-1.1-5.8c0-2.2,0.4-4.1,1.1-5.8c0.7-1.7,1.8-3.2,3.1-4.3s2.8-2.1,4.4-2.7
			C229.6,19.3,231.3,19,233.1,19z M233.1,25.9c-1.2,0-2.2,0.3-3.2,0.9c-0.9,0.6-1.6,1.4-2.2,2.5c-0.5,1-0.8,2.2-0.8,3.5
			s0.3,2.5,0.8,3.5c0.5,1,1.3,1.9,2.2,2.5c0.9,0.6,2,0.9,3.2,0.9c1.2,0,2.2-0.3,3.2-0.9c0.9-0.6,1.7-1.4,2.2-2.5
			c0.5-1,0.8-2.2,0.8-3.5s-0.3-2.5-0.8-3.5c-0.5-1-1.3-1.9-2.2-2.5C235.4,26.2,234.3,25.9,233.1,25.9z"/>
		<path class="st3" d="M259.3,19.6v19.9h11.9V46H252V19.6H259.3z"/>
		<path class="st3" d="M284.5,19.6v19.9h11.9V46h-19.2V19.6H284.5z"/>
	</g>
</g>
<circle class="st0" cx="10.6" cy="11" r="4"/>
<circle class="st0" cx="10.6" cy="55" r="4"/>
</svg>
