<svg xmlns="http://www.w3.org/2000/svg" style="enable-background:new 0 0 134.7 130.4" xml:space="preserve" viewBox="0 0 134.7 130.4">
  <path d="M134.5 60.5C132 26.7 102.8 0 67.3 0 30.2 0 0 29.2 0 65.2s30.2 65.2 67.3 65.2c4 0 7.9-.4 11.7-1 31.6-5.4 55.7-32.1 55.7-64.2 0-1.6-.1-3.2-.2-4.7zm-67.2 64c-15.4 0-29.6-5.6-40.4-14.7-7.3-15.4-8.1-40.4-8.2-45.8 0-.1.1-.2.2-.2-.2-3.1.5-6.5 2.1-9.8 3.1-6.1 7.8-11 13.9-14.4 5.7-3.3 11.9-5.5 18.3-6.8 11.7-2.5 23.7-3 35.7-1.5 9.4 1.1 16.5 3.2 22.2 6.7 5.8 3.5 8.9 8.2 8.7 13-.2 4.6-3.5 8.8-9.2 12-6.1 3.3-13.2 5.4-22.4 6.4-10.8 1.2-19.7.4-27.3-2.5-4.4-1.6-7.1-4.1-7.9-7.2-1-4 1.5-8.1 4.5-10.5 3.2-2.5 7.4-4.2 12.7-5 5.7-.9 11.6-.8 17.3.4 2 .4 4 1.2 5.7 2.4 2.1 1.6 3.1 4.3 2.5 6.9v.2c-.8 2.3-2.9 3.9-6.3 4.8-4.8 1.3-9.2.7-13.8.2h-.4c-1.1-.1-1.9-1.2-1.8-2.3s1.2-1.9 2.3-1.8h.4c4.4.5 8.2.9 12.3-.1 1.3-.3 2.9-1 3.3-2 .2-.9-.2-1.9-1-2.5-1.2-.8-2.6-1.4-4-1.6h-.1c-5.2-1.1-10.6-1.2-15.9-.4-4.6.7-8.2 2.1-10.8 4.2-1.9 1.5-3.5 4.1-3 6.2.4 1.7 2.3 3.2 5.4 4.4 6.9 2.6 15.2 3.3 25.3 2.2 8.6-.9 15.3-2.8 20.8-5.9 2.6-1.4 6.9-4.4 7.1-8.6.2-4.8-5.1-8.3-6.7-9.3-5.2-3.2-11.7-5.1-20.6-6.2-11.5-1.5-23.1-1-34.4 1.4-6.1 1.2-11.8 3.3-17.1 6.3-5.1 3-9.3 7.4-12 12.7-1.1 2.3-2.7 6.7-1.1 10.8 1.2 3 4.2 5.8 8.8 8.1 8 4.1 17.2 5.7 24.2 6.6 1.2.1 2.3.3 3.5.4 4.4.4 9.1.6 14.4.5 30.5-.3 46.5-9 54.2-15.5-.8 32-28 57.8-61.4 57.8z" style="fill:#5578f8"/>
</svg>
