<svg width="2" height="8" viewBox="0 0 2 8" fill="none" xmlns="http://www.w3.org/2000/svg">
    <path d="M1 6.66667V4" stroke="#0F0F0F" stroke-linecap="square"/>
    <path d="M1 1.33337H1.00667" stroke="#0F0F0F" stroke-linecap="square"/>
</svg>
