<svg width="8" height="6" viewBox="0 0 8 6" fill="none" xmlns="http://www.w3.org/2000/svg">
    <path d="M7.85892 4.87405L4.44494 0.238197C4.23431 -0.0478128 3.86436 -0.0809354 3.61863 0.164216C3.59585 0.186945 3.5746 0.211679 3.55507 0.238196L0.141089 4.87405C-0.0695371 5.16005 -0.0410795 5.59064 0.204651 5.8358C0.310862 5.94176 0.446135 6 0.586023 6L7.41399 6C7.73763 6 8 5.69463 8 5.31793" fill="#0F0F0F"/>
</svg>
