<svg width="40" height="20" viewBox="0 0 40 20" fill="none" xmlns="http://www.w3.org/2000/svg">
    <path d="M10.3571 16.9911H27.305M6.22453 16.9911H5.38964L0.714355 16.2494V8.461L1.88318 1.41436H21.7531L22.6297 0.672607H29.0583L29.9349 1.41436H35.4868L37.8244 10.6863V16.2494L37.24 16.9911H31.9803" stroke="#0F0F0F"/>
    <path d="M37.5316 12.1693H36.3628" stroke="#0F0F0F"/>
    <path d="M4.51318 3.64014H38.7012L39.2856 6.23627" stroke="#0F0F0F"/>
    <path d="M13.2803 3.64014V16.9917" stroke="#0F0F0F"/>
    <path d="M19.7075 3.64014V16.9917" stroke="#0F0F0F"/>
    <path d="M16.4937 5.86523L16.4937 16.9915" stroke="#0F0F0F"/>
    <path d="M33.4419 5.86523L33.4419 16.9915" stroke="#0F0F0F"/>
    <path d="M3.05176 8.83167H12.9867" stroke="#0F0F0F"/>
    <path d="M19.7075 8.8324H29.3503L31.3957 3.64014" stroke="#0F0F0F"/>
    <ellipse cx="8.13248" cy="16.9909" rx="2.22526" ry="2.22526" stroke="#0F0F0F" stroke-miterlimit="10" stroke-linecap="round"/>
    <circle cx="29.6432" cy="16.9909" r="2.22526" stroke="#0F0F0F" stroke-miterlimit="10" stroke-linecap="round"/>
</svg>
