{
    "id": "{7EF9F4F5-62DE-4A87-92EB-B3264B75D408}",
    "name": "BackupExtension",
    "type": 3,
    "vendor": "AIIS",
    "aliases": [
        "AIIS Backup Extension"
    ],
    "parentRequirements": [],
    "childRequirements": [],
    "implemented": [],
    "prefix": "AIIS"
}
