module github.com/raidancampbell/redcan

go 1.18

require (
	github.com/shirou/gopsutil/v3 v3.22.4
	github.com/sirupsen/logrus v1.8.1
	github.com/spf13/cobra v1.4.0
)

require (
	github.com/go-ole/go-ole v1.2.6 // indirect
	github.com/inconshreveable/mousetrap v1.0.0 // indirect
	github.com/lufia/plan9stats v0.0.0-20211012122336-39d0f177ccd0 // indirect
	github.com/power-devops/perfstat v0.0.0-20210106213030-5aafc221ea8c // indirect
	github.com/spf13/pflag v1.0.5 // indirect
	github.com/tklauser/go-sysconf v0.3.10 // indirect
	github.com/tklauser/numcpus v0.4.0 // indirect
	github.com/yusufpapurcu/wmi v1.2.2 // indirect
	golang.org/x/sys v0.0.0-20220520151302-bc2c85ada10a // indirect
)
