<svg xmlns="http://www.w3.org/2000/svg" width="34.718" height="34.718" viewBox="0 0 34.718 34.718">
    <g id="Groupe_313" data-name="Groupe 313" transform="translate(-2075.385 -1279.293)">
        <path id="Tracé_343" data-name="Tracé 343" d="M2084.178,1301.7l-4.089,4.089L2076,1301.7a.352.352,0,0,1,.249-.6h2.668v-16.412h-2.668a.352.352,0,0,1-.249-.6l4.089-4.089,4.089,4.089a.352.352,0,0,1-.249.6h-2.668V1301.1h2.668A.352.352,0,0,1,2084.178,1301.7Z" fill="none" stroke="#56a3a6" stroke-miterlimit="10" stroke-width="1.5" />
        <path id="Tracé_344" data-name="Tracé 344" d="M2258.487,1393.588v8.071h-5.275v-6.448a.586.586,0,0,0-.586-.586h-4.689a.586.586,0,0,0-.586.586v6.448h-5.275v-8.071l8.206-4.923Z" transform="translate(-153.78 -100.558)" fill="none" stroke="#56a3a6" stroke-miterlimit="10" stroke-width="1.5" />
        <path id="Tracé_345" data-name="Tracé 345" d="M2216.613,1335.646l-9.953-5.972-9.947,5.969a1.172,1.172,0,0,1-1.207-2.01l10.551-6.33a1.171,1.171,0,0,1,1.207,0l10.556,6.334a1.172,1.172,0,1,1-1.207,2.01Z" transform="translate(-110.158 -43.618)" fill="none" stroke="#56a3a6" stroke-miterlimit="10" stroke-width="1.5" />
        <path id="Tracé_346" data-name="Tracé 346" d="M2200.928,1616.718l4.089,4.089-4.089,4.089a.352.352,0,0,1-.6-.249v-2.668h-16.412v2.668a.352.352,0,0,1-.6.249l-4.089-4.089,4.089-4.089a.352.352,0,0,1,.6.249v2.668h16.412v-2.668A.352.352,0,0,1,2200.928,1616.718Z" transform="translate(-95.62 -311.5)" fill="none" stroke="#56a3a6" stroke-miterlimit="10" stroke-width="1.5" />
    </g>
</svg>