%YAML 1.1
%TAG !u! tag:unity3d.com,2011:
--- !u!1045 &1
EditorBuildSettings:
  m_ObjectHideFlags: 0
  serializedVersion: 2
  m_Scenes:
  - enabled: 1
    path: Assets/[Projects]/gameplay.unity
    guid: bcfaba56a08939247970f20340eebc6a
  m_configObjects: {}
