%YAML 1.1
%TAG !u! tag:unity3d.com,2011:
--- !u!1045 &1
EditorBuildSettings:
  m_ObjectHideFlags: 0
  serializedVersion: 2
  m_Scenes:
  - enabled: 1
    path: Assets/[Project_workshop]/Scene/mainmenu.unity
    guid: 3162a0a9f93ddc84290951b29526824b
  - enabled: 1
    path: Assets/[Project_workshop]/Scene/gameplay.unity
    guid: d6bd84c087d9df4479062c32b2fff18d
  m_configObjects: {}
