{
  "translation": "portuguese",
  "create": "Criar",
  "Create": "Criar",
  "credit": "Crédito",
  "Credit": "Crédito",
  "gallery": "Galeria",
  "Gallery": "Galeria",
  "Classic": "Clássico",
  "accounts": "Contas",
  "Accounts": "Contas",
  "transfer": "Transferir",
  "Transfer": "Transferir",
  "Transform": "Transformar",
  "Identity": "Identidade",
  "Profile": "Perfil",
  "settings": "Configurações",
  "Settings": "Configurações",
  "first NFT market explorer on Kusama and Polkadot": "primeiro explorador de mercado de NFTs na Kusama e Polkadot",
  "legend": "Legenda",
  "collection": "Coleção",
  "Collection": "Coleção",
  "owner": "Dono",
  "actions": "Ações",
  "facts": "Fatos",
  "instance": "Instância",
  "Instance": "Instância",
  "context": "Crie uma Coleção para seus NFTs",
  "using": "usando",
  "computed id": "id Computado",
  "content": "Conteúdo",
  "create collection": "Criar Coleção",
  "Owner address of minted art": "Endereço de arte cunhada do dono",
  "Name you want to show in gallery view": "Nome que pretende mostrar na visualização da galeria",
  "Symbol you want to trade it under": "Símbolo que você gostaria de negociar",
  "Describe your collection, it will show under collection view": "Descreva sua coleção, isso irá aparecer abaixo da visão da coleção",
  "Add collection cover which will show up at collection view": "Adicionar capa de coleção que irá mostrar na visão da coleção",
  "Select collection where do you want mint your token": "Selecione a coleção onde deseja cunhar o seu token",
  "Maximum NFTs in collection": "Máximo de NFTs na coleção",
  "Account": "Conta",
  "Name": "Nome",
  "Symbol": "Símbolo (Nome curto)",
  "Description": "Descrição",
  "Multimedia data": "Dados multimédia",
  "Metadata IPFS Hash": "Hash de metadados IPFS",
  "Learn More": "Saiba mais",
  "See More": "Veja mais",
  "Latest sales": "Últimas vendas",
  "Add Token": "Adicionar Token",
  "Mint": "Cunhar",
  "Transferable is by default": "Transferível está ativo por padrão",
  "Serial Number": "Número de Série",
  "Name of your token": "Nome do seu token",
  "Instance_tooltip": "A instância é como o identificador de um NFT, como um ticker do marketplace. É como uma \"abreviatura computer-friendly\"",
  "Upload will upload your image of the NFT": "Upload irá fazer o upload da sua imagem do NFT",
  "Click to add image": "Clique para adicionar imagem",
  "Add Animated File": "Adicionar um Arquivo Animado",
  "Image data": "Dados da Imagem",
  "Explorer": "Explorador",
  "Gallery of NFT Tokens and Collectibles": "Galeria de Tokens e Colecionáveis NFT",
  "Create your NFT Token & Collectibles": "Crie o seu Token & Colecionáveis NFT",
  "New here? We have F.A.Q.": "Novo por aqui? Nós temos um F.A.Q.",
  "Feedback? We\\'d be happy to discuss it.": "Sugestões? Nós ficariamos felizes de ouvir você.",
  "Read our story, how we started.": "Leia nossa história, como nós começamos.",
  "User Interface Mode": "Modo de Interface de Usuário",
  "Minting Settings": "Configurações de Cunhagem",
  "Advanced User Interface": "Interface Avançada de Usuário",
  "Basic User Interface": "Interface Básica de Usuário",
  "Enable Theatre View on default": "Habilitar Visão Teatral por padrão",
  "Fold history and price chart in NFT view on default": "Esconder histórico e gráfico de preço na visão do NFT por padrão",
  "Fold description in collection view on default": "Esconder descrição na visão da coleção por padrão",
  "Replace buy now with YOLO": "Substituir comprar agora com YOLO",
  "Always show NFT price by default": "Sempre mostrar preço do NFT por padrão",
  "Layout Options": "Opções de Layout",
  "Gallery Items Per Page": "Itens da Galeria por Página",
  "Collections Per Page": "Coleções Por Página",
  "Frequently Asked Question": "Perguntas Frequentemente Feitas",
  "I am helping to cover costs": "Eu estou ajudando a cobrir os custos",
  "I do not want to support": "Eu não quero apoiar",
  "faq": {
    "q": {
      "1": "O que são NFTs?",
      "2": "O que é cunhagem?",
      "3": "Como eu posso cunhar NFTs?",
      "4": "Qual é o processo quando eu sou um criador de NFT?",
      "5": "Como eu posso vender KSM obtido com a minha arte?",
      "6": "Como eu posso obter KSM como um novato?",
      "7": "Posso usar isso em mundos virtuais?",
      "8": "Como eu posso comprar KSM com ETH, DAI, BTC?",
      "9": "Eu estou recebendo erros. Como eu posso resolvê-los?",
      "10": "O que significa SEND, CONSUME, LIST?",
      "11": "Eu cunhei um NFT, mas eu não vejo ele na galeria, onde está?",
      "12": "Existe outro jeito para obter uma pequena quantia de KSM?",
      "13": "Como eu posso vender meu NFT?",
      "14": "Royalties streams settings?",
      "15": "Por que vocês escolheram construir na Kusama/Polkadot e não na Ethereum??",
      "16": "Qual a diferença entre criar utilizando o jeito Clássico, Simples e PermaFrost?",
      "17": "Vocês são financiados?",
      "18": "Você tem um canal no Telegram?",
      "19": "Você terá modo AR/VR ou uma implementação relacionada?",
      "20": "Como abrir o console de desenvolvedor?",
      "21": "Como eu atualizo os metadados da extensão?",
      "22": "Eu recebi \"Erro de Saldo Insuficiente\"",
      "23": "Como eu configuro uma identidade?",
      "24": "Existe algum token da Kodadot oficial?",
      "25": "Como eu posso contribuir para o projeto?",
      "26": "É possível movimentar NFTs de uma coleção para outra?",
      "27": "Onde eu posso acessar o mídia kit mais recente da Kodadot?"
    },
    "a": {
      "1": {
        "m": "NFTs ou tokens não fungiveis referem-se à ativos únicos, que são armazenados na blockchain e preservam a propriedade unica. @.md:faq.a.1.l1",
        "l1": "[Você pode encontrar mais sobre Tokens Não Fungíveis na Wikipedia](@.common:links.wikipedia.nft)"      },
      "2": {
        "m": "Cunhagem é um processo no qual sua carteira de criptomoedas e a blockchain comunicam-se juntas para que você possa criar NFTs."
      },
      "3": {
        "m": "No canto superior esquerdo, você clica em @.md:faq.a.3.l1 e escolhe cunhar de forma <b>Simples</b> ou <b>Clássica</b>.",
        "l1": "[Create](@.common:links.rmrk_create.href)"
      },
      "4": {
        "m": "Primeiramente, você precisa instalar @.md:faq.a.4.l1, <b>faça o backup da sua seed</b>. Então você pode depositar no seu endereço de carteira @.md:faq.a.4.l2 ou usar nosso @.md:faq.a.4.l3 recurso. Uma vez que você obteve os fundos, dirija-se à @.md:faq.a.4.l4, escolha Coleção. Aguarde até que a Coleção seja cunhada, então você pode ir para @.md:faq.a.4.l5 e cunhar seu primeiro token! Sinta-se à vontade para compartilhar ele com a gente no nosso @.md:faq.a.4.l6",
        "l1": "[Polkadot Extension](@.common:links.polkadot_js_extension.href)",
        "l2": "[here](@.common:links.rmrk_credit.href)",
        "l3": "[grant](@.common:links.artist_grant_program.href)",
        "l4": "[Create](@.common:links.rmrk_create.href)",
        "l5": "[Create Token](@.common:links.rmrk_create.href)",
        "l6": "[Create Token.](@.common:links.kodadot_social.discord.href)"
      },
      "5": {
        "m": "Agora, existe uma variedade de @.md:faq.a.5.l1 que suporta negociação de KSM. A mais seguro é provavelmente @.md:faq.a.5.l2 e @.md:faq.a.5.l3 ou tente descentralizadas @.md:faq.a.5.l4",
        "l1": "[exchanges](@.common:links.coingecko_ksm_markets.href)",
        "l2": "[Binance](@.common:links.binance_exchange.href)",
        "l3": "[Bybit](@.common:links.bybit_exchange.href)",
        "l4": "[simpleswap.](@.common:links.simpleswap_exchange.href)"
      },
      "6": {
        "m": "Nós recomendamos obter KSM através de exchanges custodiadas como @.md:faq.a.6.l1 e @.md:faq.a.6.l2 ou você pode usar nossa integração com a RAMP network - um metodo de compra utilizando moeda fiduciária @.md:faq.a.6.l3 Se você está se esforçando demais com isso, sinta-se livre para perguntar por uma @.md:faq.a.6.l4 ou deixe a gente saber em @.md:faq.a.6.l5 nosso canal no Discord.",
        "l1": "[Binance](@.common:links.binance_exchange.href)",
        "l2": "[Bybit](@.common:links.bybit_exchange.href)",
        "l3": "[here.](@.common:links.rmrk_credit.href)",
        "l4": "[grant](@.common:links.artist_grant_program.href)",
        "l5": "[help](@.common:links.kodadot_social.discord_help.href)"
      },
      "7": {
        "m": "Nós estamos explorando possibilidades, nós atualmente planejamos ativamente pesquisar isso em nosso marco 2."
      },
      "8": {
        "m": "Para melhores cotações, você pode @.md:faq.a.8.l1 Para melhor experiência @.md:faq.a.8.l2 Se você está @.md:faq.a.8.l3",
        "l1": "[use exchange custodiada da lista](@.common:links.coingecko_ksm_price.href)",
        "l2": "[nós recomendamos a você usar a Binance.](@.common:links.binance_exchange.href)",
        "l3": "[buscando por uma negociação simples, tente SimpleSwap.](@.common:links.simpleswap_exchange.href)"
      },
      "9": {
        "m": "Nós estamos tentanto entregar atualizaçções incrementadas diariamente e correções o quanto antes. Nós podemos publicar nova versão e seu browser tem uma versão antiga em cache. Se você estiver no Windows, tente segurar Ctrl e então pressionar F5. Usuários mac, segurem CMD e Shift então pressionem R. Se isso não adiantar, Mande-nos uma mensagem privada no Twitter ou Discord com uma screenshot onde o console de desenvolvedor está aberto."
      },
      "10": {
        "m": "ENVIAR irá enviar para alguém, CONSUME irá queimar isso, LIST para listar , SEND irá enviar para alguém, CONSUME irá queimar isso, LIST irá lista isso à venda para que alguém possa comprar de você."
      },
      "11": {
        "m": "O melhor jeito é checar através de @.md:faq.a.11.l1 e procurar pelo seu endereço. @.md:faq.a.11.l2",
        "l1": "[Explorador Subscan](@.common:links.kusama_scanner.href)",
        "l2": "[Você pode achar exemplos de como NFTs mintados/cunhados aparecem através do explorador, quando você olha em extrinsics](@.common:links.kusama_scanner.extrinsic.href)"
      },
      "12": {
        "m": "Sim, se o problema por exemplo é problematico para você sacar de uma exchange ou usar um fiat-onramp, você pode visitar nosso discord e pedir por uma pequena quantia de KSM no canal @.md:faq.a.12.l1 em nosso discord ou peça por @.md:faq.a.12.l2 para cobrir os custos de cunhagem.",
        "l1": "[help](@.common:links.kodadot_social.discord_help.href)",
        "l2": "[grant](@.common:links.artist_grant_program.href)"
      },
      "13": {
        "m": "Se você não estabeleceu o preço do seu NFT no começo, navegue para seu @.md:faq.a.13.l1, escolha seu NFT em Criado e clique em LISTAR, que você estará apto a estabelecer o preço.",
        "l1": "[profile](@.common:links.rmrk_profile.href)"
      },
      "14": {
        "m": "Agora, nós não temos lógica encadeada, mas nós planejamos implementar algo incrível, em breve. @.md:faq.a.14.l1",
        "l1": "[Fique com a gente e siga-nos @KodaDot!](@.common:links.kodadot_social.twitter.href)"
      },
      "15": {
        "m": "Nós acreditamos que os custos para ações na Ethereum podem ser altos no futuro e está atualmente usando o protocolo de consenso PoW e isso não é amigável para o ambiente. Nós acreditamos nos efeitos de rede de Kusama/Polkadot a partir de outras parachains. Uma resposta mais detalhada pode ser encontrada @.md:faq.a.15.l1",
        "l1": "[here.](@.common:links.chain_decision.href)"
      },
      "16": {
        "m": "<b>CLÁSSICO/b> nós permite que você crie a coleção e adicione NFTs nela. <b>SIMPLES</b> cunhagem irá criar NFTs colecionáveis e adicionará à seu perfil e <b>PERMAFROST</b> é uma cunhagem de NFT utilizando o protocolo da Arweave: O protocolo combina pessoas que tem espaço disco rigido para compartilhar espaço com aqueles individuos e organizações que precisam armazenar dados e hospedar conteúdo permanentemente."
      },
      "17": {
        "m": "Right now, we have @.md:faq.a.17.l1 We are actively looking for funding options, eventually we would raise private funds. DMs us, if you are interested into private sale.",
        "l1": "[Kusama Treasury funding for Milestone 1.](@.common:links.kusama_polkassembly.kodadot_nft_explorer_post.href)"
      },
      "18": {
        "m": "Nós só temos um canal privado para criadores NFT. Sinta-se livre para nos mandar uma mensagem direta se você é um criador de NFT!"
      },
      "19": {
        "m": "Sim, isso é parte do nosso marco 2, fique ligado!"
      },
      "20": {
        "m": "Se você está no Mac, no Chrome aperte <b> Option, CMD, J</b>, Firefox <b>Command + Option + K</b>."
      },
      "21": {
        "m": "Vá para @.md:faq.a.21.l1 e clique no botão <b>Atualizar metadados</b>, então atualize sua janela. Isso pode estar trabalhando com diferente tipos de cadeias.",
        "l1": "[Dotapps.io, Settings > Metadata](@.common:links.dotapps_io.kusama_rpc_settings_metadata.href)"
      },
      "22": {
        "m": "Confira se você tem $KSM <b>negociável</b> na sua conta, que não esteja em staking. Isso é diferente. Você pode checar isso em @.md:faq.a.22.l1 e em saldos em paineis especificos, onde o valor <b>transferível</b> será mostrado.",
        "l1": "[Dotapps.io > Comptes](@.common:links.dotapps_io.kusama_rpc_accounts.href)"
      },
      "23": {
        "m": "Você pode aprender mais @.md:faq.a.23.l1",
        "l1": "[how to set identity on Kusama network](@.common:links.kusama_network.docs.mirror_learn_identity.href)."
      },
      "24": {
        "m": "Não, não tem um token oficial lançado. Por favor siga a nossa mídia social oficial e esteja atento sobre tentativas de scam e phishing vindos de fontes não oficiais. DYOR."
      },
      "25": {
        "m": "Nós estamos sempre recebendo contribuições da nossa comunidade. Existem numerosas @.md:faq.a.25.l1 para todos os níveis de skill - alguns irão, até mesmo, ser recompensados em $KSM @.md:faq.a.25.l2",
        "l1": "[open issues](@.common:links.kodadot_social.open_issues.href)",
        "l2": "[Make your first contribution!](@.common:links.kodadot_social.contributing_guide.href)"
      },
      "26": {
        "m": "Não, essa possibilidade não está disponivel no momento. Se você gostaria de propor uma mudança, sinta-se à vontade para criar uma @.md:faq.a.26.l1 em nosso GitHub.",
        "l1": "[issue](@.common:links.kodadot_social.open_issues.href)"
      },
      "27": {
        "m": "Você pode acessar o mídiakit mais recente @.md:faq.a.27.l1",
        "l1": "[here.](@.common:links.kodadot_social.presskit.href)"
      }
    }
  },
  "funfacts": {
    "1": {
      "heading": "Você sabia...",
      "question": "que em 2015 nós lançamos o primeiro NFT oficial chamado Etheria?"
    },
    "2": {
      "heading": "Você sabia...",
      "question": "que o primeiro padrão 'como NFTs' na Kusama é literalmente só strings de bytes?"
    },
    "3": {
      "heading": "Você sabia...",
      "question": "que Kodadot começou como uma reescrita de DotApps baseados em React em Vuejs?"
    },
    "4": {
      "heading": "Você sabia...",
      "question": "que KodaDot está construindo um landscape experimental NFT?"
    },
    "5": {
      "heading": "Você sabia...",
      "question": "que existem muitas artes NFTs psicodélicas e alucinantes? Nós também não."
    },
    "6": {
      "heading": "Consegue adivinhar...",
      "question": "Quantas parachains KodaDot suporta? Obtenha a resposta exata em nosso Discord!"
    },
    "7": {
      "heading": "Consegue adivinhar...",
      "question": "quantos forks no Github o repositário da KodaDot tem?"
    },
    "8": {
      "heading": "Consegue adivinhar...",
      "question": "Quantas estrelas GitHub o repositório da KodaDot tem?"
    },
    "9": {
      "heading": "Você acha que ...",
      "question": "KodaDot deveria lançar seu próprio $koda token?"
    },
    "10": {
      "heading": "Consegue adivinhar...",
      "question": "Quantos NFTs Kodadot está indexando de todas as parachains?"
    },
    "11": {
      "heading": "Você sabia...",
      "question": "que KodaDot tem um aplicativo mobile?"
    },
    "12": {
      "heading": "Você sabia...",
      "question": "que KodaDot estava entre as primeiras galerias de NFTs suportando realidade aumentada para objetos 3D, no começo de Janeiro de 2021?"
    },
    "13": {
      "heading": "Você sabia...",
      "question": "que KodaDot teve algumas bagunças durante seus primeiros dias? Sim, todas as startups se movimentam através de falhas para aprender com os erros. É assim que nós sabemos que nosso produto estsá ficando melhor."
    },
    "14": {
      "heading": "Você sabia...",
      "question": "que Kodadot tem seus próprios principais valores e caráter moral sendo distribuido, descentralizado e em posse da comunidade? Participe de nossa comunidade crescente!"
    },
    "15": {
      "heading": "Você sabia...",
      "question": "que KodaDot trocou três dos seus logos em um mês?"
    },
    "16": {
      "heading": "Você sabia...",
      "question": "que a comunidade da Kodadot de traduções foi um hack de melhoramento para construção e participação da comunidade?"
    },
    "17": {
      "heading": "Você sabia...",
      "question": "que KodaDot tinha 420 membros no Discord no seu deck de investidores? Que coincidência."
    },
    "18": {
      "heading": "Você sabia...",
      "question": "que os fundadores da Kodadot, encorajam o forking da base de código e recebem mais instâncias de Kodadot na natureza?"
    },
    "19": {
      "heading": "Você sabia...",
      "question": "que um dos fundadores da KodaDot estava rodando uma infraestrutura para eSports em 2006?"
    },
    "20": {
      "heading": "Você sabia...",
      "question": "que esses fatos não importam muito? Nós só amamos gastar tempo com você até sua ação estar finalizada na Blockchain."
    },
    "21": {
      "heading": "Não esqueça de...",
      "question": "beber água para ficar hidratado!"
    },
    "22": {
      "heading": "Você sabia...",
      "question": "que nós temos mais de 500 solicitações abertas em nosso backlog no Github?"
    },
    "23": {
      "heading": "Você sabia...",
      "question": "que Kodadot promove uma cultura de inclusão para receber um amplo espectro de artistas que contribuem para seu crescimento?"
    },
    "24": {
      "heading": "Você sabia...",
      "question": "que se você fizer uma pull request no repositório da Kodadot, sua curiosidade pode ser mostrada aqui?"
    },
    "25": {
      "heading": "Você já checou...",
      "question": "suas vendas de JPEG hoje?"
    },
    "26": {
      "heading": "Você já...",
      "question": "cunhou algo bonito hoje?"
    },
    "27": {
      "heading": "Você sabia...",
      "question": "que a primeira versão de KodaDot parecia pior que Craiglist em 1999?"
    },
    "28": {
      "heading": "Você sabia...",
      "question": "que os fundadores da KodaDot ganharam alguns poucos hackathons da Ethereum e Polkadot no passado?"
    },
    "29": {
      "heading": "Você sabia...",
      "question": "que KodaDot teve que demitir algumas dezenas de investidores interessados em nos patrocinar?"
    },
    "30": {
      "heading": "Você sabia...",
      "question": "que KodaDot se importa com mudança climática através do plantio de árvores em Portugal, chamada KodaForest?"
    },
    "31": {
      "heading": "Você sabia...",
      "question": "que os fundadores da Kodadot acreditam em realidade simulada?"
    },
    "32": {
      "heading": "Você sabia...",
      "question": "que você parece bonito hoje?"
    },
    "33": {
      "heading": "Você sabia...",
      "question": "que pessoas do mundo todo contribuem para nossa base de código?"
    },
    "34": {
      "heading": "Você sabia...",
      "question": "que KodaDot tem compensado 10.000 kg de C02, que é equivalente à 2.500 cheeseburguers?"
    },
    "35": {
      "heading": "Você sabia...",
      "question": "que você pode obter uma overview de todos os atalhos disponíveis pressionando '?'"
    }
  },
  "sort": {
    "BLOCK_NUMBER_DESC": "Novos primeiro",
    "BLOCK_NUMBER_ASC": "Antigos primeiro",
    "UPDATED_AT_DESC": "Última interação",
    "UPDATED_AT_ASC": "Muito tempo sem interações",
    "PRICE_DESC": "A partir do mais caro",
    "PRICE_ASC": "A partir do mais barato",
    "listed": "Compre agora"
  },
  "mint": {
    "submit": "Clique para criar NFT(s)",
    "estimate": "Mostrar as taxas de transação",
    "estimated": "Taxas de transação custarão cerca de",
    "success": "Parabéns para o seu novo NFT(s)",
    "shareWithFriends": "Compartilhe {0} com seus amigos",
    "unlimited": "Itens ilimitados na sua coleção",
    "nfsw": "Conteúdo explicito (NSFW)",
    "mass": "Cunhagem em massa de NFTs",
    "command": "Lista de comandos para cunhagem em massa",
    "transform": "Transformar comandos em NFT",
    "deposit": "Deposito atual",
    "expert": {
      "show": "Mostrar configurações avançadas",
      "hide": "Esconder configuações avançadas",
      "count": "Endereços atualmente encontrados {0} ",
      "countGlitch": "Você tem mais endereços que edições disponíveis. Isso pode causar um problema. Considere para configurar o campo EDIÇÃO para pelo menos {0}",
      "postfix": "Adicionar hashtag e índice após o nome (e.g #1)",
      "sync": "Sincronizar edições para {0}"
    },
    "collection": {
      "name": {
        "label": "nome da Coleção",
        "placeholder": "Insira o nome da Coleção",
        "message": "Nomeie sua coleção. Isso estará visível na galeria"
      },
      "description": {
        "label": "Descrição da Coleção",
        "placeholder": "Insira a descrição da coleção",
        "message": "Descrição da sua coleção. Markdown é suportado"
      },
      "symbol": {
        "label": "Símbolo (nome curto)",
        "placeholder": "nome longo de 3 - 5 caracteres",
        "message": "O simbolo será atribuido ao NFT: por exemplo, Kusama está rotulado como KSM"
      }
    },
    "nft": {
      "name": {
        "label": "nome",
        "placeholder": "Insira o nome do NFT",
        "message": "Nomeie seu NFT. Isso estará visível na galeria"
      },
      "description": {
        "label": "Descrição de NFT",
        "placeholder": "Insira a descrição do NFT",
        "message": "Descrição do seu NFT. Markdown é suportado"
      },
      "edition": {
        "label": "Edição",
        "placeholder": "Mínimo é 1",
        "message": "Número de NFTs a serem cunhados"
      }
    }
  },
  "tooltip": {
    "symbol": "O simbolo que está atribuido para o NFT: por exemplo Kusama é rotulado como KSM",
    "name": "NFT será visível abaixo desse nome na galeria",
    "edition": "Número de cópias",
    "created": "Criado por",
    "collections": "Coleções criadas por",
    "sold": "NFTs vendidos por",
    "collected": "NFTs colecionados por",
    "buy": "Mostrar somente nfts disponiveis para compra",
    "random": "Ir para uma página aleatória",
    "buyDisabled": "Sem saldo suficiente"
  },
  "nft": {
    "carbonless": "Este NFT é ecologicamente sem carbono",
    "burned": "NFT está queimado",
    "description": "descrição do NFT",
    "name": "Nomeie seu NFT",
    "frozen": "NFT está congelado",
    "event": {
      "MINTNFT": "🖼  'CUNHAR'",
      "LIST": "📰  LISTAR",
      "SEND": "🎁  PRESENTEAR",
      "CONSUME": "🔥 QUEIMAR",
      "BUY": "🤝  COMPRAR"
    }
  },
  "loader": {
    "casting": "(1/3) Transmitindo a transação para a Blockchain",
    "finalized": "(3/3) Finalizado",
    "block": "(2/3) Transação no bloco",
    "pinImage": "Pinando Imagem",
    "pinMeta": "Pinando Metadados",
    "constructTx": "Construindo transação",
    "sign": "Aguardando a resposta de um signatário",
    "ipfs": "Fazendo Upload de dados para IPFS",
    "arweave": "Armazenando dados via PermaFrost",
    "uploading": "({0}/{1}) Fazendo upload para IPFS",
    "checkBalance": "Checando se você tem saldo suficiente"
  },
  "Spotlight": "Destaque",
  "Simple": "Simples",
  "About": "Sobre",
  "FAQ": "FAQ",
  "Partnerships & Ambassadors": "Parcerias & Embaixadores",
  "Press Kit": "Mídia Kit",
  "Jobs": "Empregos",
  "theatre": "teatro",
  "view": "visão",
  "price": "preço",
  "arweave": {
    "uploadYes": "Upload da imagem NFT para Arweave",
    "uploadNo": "Não usar Arweave",
    "tooltip": "Usar Arweave significa que você está armazenando seu conteúdo multimidia para sempre na Arweave, bom para 'pequenos' arquivos como JPEG."
  },
  "carbonOffset": {
    "carbonOffsetYes": "Eu estou fazendo NFT sem carbono",
    "carbonOffsetNo": "Eu não quero ter NFT sem carbono",
    "tooltip": "NFT Sem Carbono significa estar ajudando a cobrir custos para créditos de carbono e plantando árvores"
  },
  "support": {
    "tooltip": "Cobrir custos significa que os usuários ajudam a apoiar custos iniciais da KodaDot que armazena seu JPEG no seu lado."
  },
  "termOfService": {
    "accept": "Eu confirmo que eu detenho total direito de propriedade do ativo digital enviado (ou detêm permissão suficiente do proprietario para utilizar o ativo)"
  },
  "profile": {
    "user": "Usuário",
    "created": "Criado",
    "collected": "Colecionado",
    "sold": "Vendido",
    "showQr": "Mostrar QR"
  },
  "spotlight": {
    "title": "Usuário em Destaque",
    "subtitle": "Mostrando os mais ativos colecionadores e artistas que usam RMRK.",
    "filter_accounts": "Contas com Identidade",
    "id": "Criador",
    "sold": "Vendido",
    "unique": "∃!",
    "total": "Total",
    "averagePrice": "Ø preço",
    "count": "Σ coleção",
    "collectors": "Colecionadores",
    "score": "Pontuação",
    "empty": "Vazio",
    "uniqueCollectors": "∃! colecionadores"
  },
  "series": {
    "title": "Coleção em Destaque",
    "subtitle": "Os NFTs em destaque na RMRK, ranqueados por volume, preço mínimo e outras estatísticas.",
    "assets": "Ativos",
    "buys": "Compras",
    "collected": "Colecionado",
    "floorprice": "Preço mínimo",
    "owners": "Proprietários",
    "volume": "Volume"
  },
  "tutorial": {
    "create": "1. Crie uma conta polkadot js",
    "ksm": "2. Obter KSM",
    "mint": "3. Cunhagem"
  },
  "general": {
    "balance": "Saldo",
    "submit": "Enviar",
    "remove": "Remover",
    "correctAddress": "Formato correto de endereço",
    "copyUrl": "Copiar URL",
    "openUrl": "Abrir URL"
  },
  "helper": {
    "noCollections": "Você não tem coleções",
    "noInfinityCollections": "Você não tem coleções com NFTs ilimitados",
    "indexerReadOnly": "App é um modo somente de leitura, tente reiniciar o app ou visitar o Discord.",
    "clickToCreate": "Clique aqui para criar coleção",
    "urlToTransform": {
      "label": "URL para transformar",
      "placeholder": "singular.rmrk.app/collectibles/",
      "copy": "Link Kodadot copiado com sucesso"
    }
  },
  "cookies": {
    "notice": "Nós usamos um terceirizado 🍪 para personalizar sua experiência no site",
    "accept": "Aceitar",
    "decline": "Recusar"
  },
  "action": {
    "admin": "Painel de Administrador",
    "click": "Clique para {0} NFT(s)",
    "omitListed": "Pular NFT(s) listados",
    "random": "Use aleatório",
    "distributionCount": "Porcentagem que irá ser distribuida",
    "sendToMyself": "Enviar para mim mesmo"
  },
  "identity": {
    "set": "Criar identidade on-chain",
    "click": "Clique para criar sua identidade",
    "handleRequired": "Seu nome de usuário (handle) é requisitado",
    "deposit": "Depositar"
  },
  "massMint": {
    "tutorial": {
      "basic": {
        "title": "Cunhagem em massa básica",
        "description": "Esse é a cunhagem básica, isso irá criar NFTs com o mesmo símbolo e nome, mas diferentes quantidades. Isso também irá criar valores diferentes de NFTs com o mesmo símbolo e nome, mas diferente quantia."
      },
      "range": {
        "title": "Alcance da cunhagem em massa",
        "description": "Você pode especificar o alcance da cunhagem em massa, isso irá criar NFTs com o mesmo símbolo e nome, mas quantia diferente. Isso também irá criar valores diferentes de NFTs com o mesmo símbolo e nome, mas diferente quantia."
      },
      "all": {
        "title": "Cunhagem em massa de todos",
        "description": "Você pode especificar o alcance da cunhagem em massa, isso irá criar NFTs com o mesmo simbolo e nome, mas diferente quantia. Isso também irá criar valores diferentes de NFTs com o mesmo símbolo e nome, mas diferente quantia."
      }
    },
    "syntax": {
      "file": "Nome do arquivo (e.g impressionante_1.jpg)",
      "name": "Nome do NFT (e.g Token Impressionante)",
      "amount": "Preço do token (e.g 0.01)",
      "description": "Descrição multilinha do token (e.g Este é um token impressionante)",
      "range": "Alcance dos tokens (e.g 1-5)",
      "all": "Aplicar para todos os tokens (use três pontos: ...)"
    }
  },
  "collapse": {
    "collection": {
      "description": {
        "show": "Mostre-me a descrição",
        "hide": "Esconder a descrição"
      },
      "attributes": {
        "show": "Mostrar atributos on-chain",
        "hide": "Esconder atributos on-chain"
      }
    }
  },
  "sharing": {
    "collection": "Confira essa Coleção interessante na KodaDot",
    "nft": "Confira esse NFT interessante na KodaDot",
    "pack": "Confira esse Pack interessante na Kodadot",
    "profile": "Confira esse Perfil interessante em KodaDot"
  },
  "warning": {
    "newTransactionWhilePriceSet": "Definir o preço agora requer a realização de uma transação adicional."
  },
  "teleport": {
    "route": "Teleportando {0} de {1} para {2}"
  },
  "preferences": {
    "basic": "interface de usuário básica",
    "advanced": "interface de usuário avançada",
    "theater": "Habilitar Visão Teatral por padrão",
    "fold": {
      "history": "Esconder historico e gráfico de preço na visão de NFT por padrão",
      "description": "Esconder descrição na visão de coleção por padrão"
    },
    "yolo": "Substituir BUY NOW com YOLO",
    "priceVisible": "Sempre mostrar o preço na visão de galeria e de coleção como padrão",
    "loadAllArtworks": "Carrega todas as artes na galeria por padrão (videos, etc.)"
  }
}
