{
  "applications": "*",
  "changelogDate": "20220603081820",
  "dto": "no",
  "embedded": false,
  "entityTableName": "document_verification",
  "fields": [
    {
      "fieldName": "documentType",
      "fieldType": "DocumentType",
      "fieldValues": "IBAN_LETTER (Iban Letter),BALANCE_CERT (Balance Certification),STATEMENT (Statement)"
    },
    {
      "fieldName": "customerNumber",
      "fieldType": "String"
    },
    {
      "fieldName": "referenceNumber",
      "fieldType": "String"
    }
  ],
  "fluentMethods": true,
  "jpaMetamodelFiltering": false,
  "name": "DocumentVerification",
  "pagination": "no",
  "readOnly": false,
  "relationships": [],
  "service": "no"
}
