{
  "project_info": {
    "project_number": "514558378854",
    "firebase_url": "https://inquire-c4565.firebaseio.com",
    "project_id": "inquire-c4565",
    "storage_bucket": "inquire-c4565.appspot.com"
  },
  "client": [
    {
      "client_info": {
        "mobilesdk_app_id": "1:514558378854:android:1115aac22592840a",
        "android_client_info": {
          "package_name": "com.freelancer.ahmedabdeen11.inquire"
        }
      },
      "oauth_client": [
        {
          "client_id": "514558378854-m41fidvh0mes7vi6eumlllptbvt9gc1g.apps.googleusercontent.com",
          "client_type": 1,
          "android_info": {
            "package_name": "com.freelancer.ahmedabdeen11.inquire",
            "certificate_hash": "f85eb58959bcaea76d08d709ed5978c395c359d6"
          }
        },
        {
          "client_id": "514558378854-uuhpa2qu8e41ailv3ucqcqorhk8mreft.apps.googleusercontent.com",
          "client_type": 3
        }
      ],
      "api_key": [
        {
          "current_key": "AIzaSyB6-kxV566LmqViQhDU0zZgGJiZw0xgo3M"
        }
      ],
      "services": {
        "analytics_service": {
          "status": 1
        },
        "appinvite_service": {
          "status": 2,
          "other_platform_oauth_client": [
            {
              "client_id": "514558378854-uuhpa2qu8e41ailv3ucqcqorhk8mreft.apps.googleusercontent.com",
              "client_type": 3
            }
          ]
        },
        "ads_service": {
          "status": 2
        }
      }
    }
  ],
  "configuration_version": "1"
}