<15061-5>
<29959-0>
<29815-3>
<16028-5>
<19346-4>
<29876-4>
<19395-5>
<19260-0>
<19549-4>
<11289-2>
<11790-4>
<10005-5>
<10206-2>
<19304-6>
<29640-5>
<29566-5>
<71098>
<70799>
<13245-5>
<26524-1>
<17977-0>
<19517-3>
<17994-0>
<14626-2>
<12001-3>
<71085>
<26785-1>
<10797-2>
<26631-0>
<13697-5>
<12427-4>
<28045-3>
<12299-1>
<19842-6>
<10746-5>
<11705-0>
<16808-0>
<10214-3>
<14142-3>
<18134-3>
<19195-6>
<29570-0>
<11813-4>
<14897-6>
<17433-5>
<12020-6>
<20104-4>
<30107-6>
<12640-4>
<18816-5>
<13219-6>
<16563-4>
<10126-0>
<12137-6>
<10691-4>
<25881-3>
<13715-1>
<29884-5>
<18552-6>
<19482-3>
<16246-2>
<12337-5>
<11602-3>
<12643-5>
<15977-3>
<12208-2>
<29605-0>
<71101>
<18726-6>
<29606-5>
<26843-6>
<18011-5>
<17811-6>
<19789-5>
<18610-4>
<29999-2>
<15101-5>
<10210-4>
<10658-2>
<15982-3>
<18103-0>
<26680-1>
<13347-4>
<10229-4>
<10380-0>
<26433-4>
<12042-3>
<10905-4>
<70397>
<28225-1>
<16672-6>
<17932-1>
<14262-0>
<29233-4>
<12425-1>
<14404-6>
<18252-4>
<13541-1>
<15017-1>
<12165-1>
<16955-1>
<27161-6>
<19534-3>
<71011>
<11875-3>
<29983-3>
<10135-6>
<30063-0>
<15657-0>
<13003-1>
<29541-0>
<10426-2>
<17743-4>
<19820-2>
<183026>
<16783-4>
<13971-4>
<29986-4>
<18769-2>
<10125-2>
<70238>
<29721-5>
<16619-3>
<19848-1>
<13292-3>
<18106-1>
<16697-4>
<17465-6>
<15479-5>
<12796-1>
<182563>
<11551-1>
<18301-3>
<15498-1>
<11683-5>
<10575-6>
<71046>
<13398-1>
<11992-6>
<26704-6>
<14953-1>
<18864-1>
<13352-4>
<14438-3>
<13414-1>
<10213-5>
<19786-4>
<13716-6>
<11981-4>
<18448-1>
<10437-4>
<26557-0>
<12607-2>
<30096-6>
<11174-5>
<12041-5>
<10773-2>
<18161-0>
<15966-1>
<14817-2>
<14840-0>
<26289-6>
<29747-1>
<13815-4>
<16721-5>
<12110-5>
<19244-5>
<19669-1>
<29161-3>
<13763-4>
<12491-2>
<194398>
<18365-5>
<19481-5>
<70833>
<73348>
<w>
<73104>
<29832-3>
<12620-3>
<70274>
<11153-6>
<12262-3>
<19267-0>
<11156-0>
<70926>
<29925-3>
<10913-5>
<14949-6>
<19303-1>
<10338-6>
<29891-1>
<12160-4>
<19262-3>
<29943-1>
<13742-5>
<14014-5>
<13310-6>
<29421-3>
<11184-2>
<29889-2>
<29915-6>
<70823>
<12504-5>
<19637-0>
<70198>
<13830-1>
<11937-0>
<26405-2>
<19403-4>
<15964-5>
<10332-4>
<15911-5>
<12829-5>
<11640-2>
<12820-2>
<11751-0>
<11519-4>
<16825-0>
<71018>
<24782-3>
<26312-2>
<19023-0>
<11382-5>
<13336-2>
<18120-0>
<18024-3>
<13690-5>
<10314-6>
<13346-6>
<11277-2>
<16687-0>
<17702-4>
<18789-3>
<14932-2>
<12974-3>
<30064-5>
<26942-4>
<19626-5>
<11432-2>
<15480-6>
<26360-5>
<70875>
<13701-5>
<26540-3>
<17595-0>
<19632-3>
<28894-0>
<12158-5>
<70970>
<70244>
<14728-1>
<13682-4>
<13661-5>
<18643-3>
<14131-1>
<71038>
<16527-1>
<10323-5>
<11295-0>
<29261-6>
<17722-5>
<30102-2>
<11314-1>
<12366-5>
<10225-5>
<10361-4>
<19054-3>
<26329-6>
<11692-4>
<15768-5>
<18317-2>
<19665-2>
<10719-1>
<10297-1>
<13078-5>
<11350-4>
<29964-0>
<13669-3>
<15993-5>
<11913-0>
<18391-4>
<19501-4>
<12062-4>
<12244-5>
<19447-5>
<18069-2>
<12592-3>
<13080-4>
<29950-4>
<11267-5>
<19258-1>
<10397-4>
<12403-4>
<12234-1>
<15655-4>
<18400-1>
<189442>
<26379-5>
<12053-5>
<16633-2>
<70561>
<10035-3>
<14486-6>
<12735-0>
<26501-6>
<18976-4>
<27272-4>
<11667-3>
<29611-5>
<19743-1>
<18067-6>
<73103>
<18009-6>
<13528-0>
<29634-0>
<29242-3>
<28230-1>
<19653-2>
<19452-5>
<17477-6>
<12972-0>
<29754-4>
<26331-5>
<16966-3>
<16271-3>
<17804-3>
<11354-3>
<16732-0>
<19213-2>
<10328-2>
<26278-4>
<11653-0>
<19736-5>
<27862-4>
<10414-2>
<30016-2>
<15437-0>
<10251-4>
<17777-1>
<11857-5>
<14940-3>
<12146-5>
<17968-1>
<19513-4>
<13823-5>
<19816-0>
<15979-6>
<16587-4>
<16967-1>
<11812-6>
<71092>
<12821-0>
<16426-0>
<16335-3>
<70986>
<29326-4>
<11506-6>
<10029-5>
<12733-4>
<17983-5>
<11786-2>
<10070-1>
<73366>
<19275-1>
<29624-3>
<70901>
<10018-3>
<70256>
<18978-0>
<17784-4>
<10095-6>
<11404-0>
<29762-5>
<15076-6>
<19057-4>
<18981-4>
<16698-2>
<73342>
<12922-1>
<24847-1>
<29143-5>
<25822-5>
<10581-4>
<17951-4>
<12984-0>
<18235-4>
<14236-1>
<15928-2>
<11372-1>
<15869-6>
<12774-4>
<29856-3>
<29734-3>
<29776-1>
<29887-6>
<12717-2>
<18080-0>
<15060-0>
<16193-4>
<14808-3>
<73338>
<27445-6>
<13557-0>
<16036-6>
<29653-3>
<29862-1>
<11904-1>
<70550>
<73393>
<13322-6>
<13888-5>
<12757-4>
<16396-4>
<16611-5>
<19315-1>
<16517-4>
<11902-5>
<13638-0>
<30093-5>
<19147-3>
<17641-5>
<13075-4>
<13312-2>
<15111-2>
<14043-5>
<19540-1>
<11311-0>
<12495-1>
<16972-1>
<15971-1>
<197953>
<19819-1>
<10271-5>
<16277-5>
<70355>
<15554-3>
<12341-0>
<19400-3>
<13523-3>
<10032-2>
<70856>
<13308-0>
<16521-6>
<26148-3>
<21002-0>
<18101-4>
<16314-4>
<18665-0>
<29872-5>
<14192-2>
<12304-6>
<29765-6>
<11274-1>
<18841-6>
<18174-5>
<26581-3>
<70485>
<17576-4>
<18732-4>
<11168-0>
<14079-5>
<29922-2>
<29701-4>
<11071-1>
<14078-0>
<14301-2>
<29906-0>
<15893-2>
<19515-0>
<14057-1>
<17940-2>
<16524-0>
<26476-0>
<70651>
<10173-5>
<14180-2>
<18004-2>
<29998-4>
<10830-2>
<18071-1>
<17201-5>
<30033-2>
<14092-6>
<19483-1>
<70188>
<12079-1>
<12781-0>
<26676-6>
<16980-2>
<19420-4>
<18115-0>
<10583-0>
<14307-4>
<15298-2>
<19655-5>
<29613-1>
<18604-6>
<13128-2>
<11833-5>
<18695-5>
<10387-0>
<18368-6>
<18589-4>
<26735-2>
<26858-0>
<29723-1>
<29877-2>
<16797-0>
<18556-5>
<19373-1>
<11957-1>
<11535-6>
<19680-6>
<11330-3>
<10560-5>
<18939-3>
<29912-5>
<29560-3>
<14100-5>
<187379>
<30001-1>
<18394-5>
<12963-1>
<14261-2>
<29892-6>
<10395-1>
<19295-2>
<16292-2>
<16663-0>
<11507-4>
<17986-6>
<26502-4>
<14803-6>
<12951-1>
<19696-5>
<16695-1>
<70201>
<12164-3>
<19076-0>
<29582-0>
<19818-3>
<70235>
<18670-0>
<15410-6>
<18687-4>
<15698-0>
<18086-2>
<13430-3>
<15879-3>
<18535-6>
<18196-2>
<11310-2>
<11793-5>
<17104-3>
<14439-1>
<12331-3>
<16666-1>
<17674-4>
<12206-6>
<20077-2>
<10103-5>
<29874-1>
<10334-0>
<15810-4>
<14091-1>
<29625-1>
<10602-1>
<13290-0>
<11457-0>
<10564-4>
<29945-4>
<11297-3>
<13097-1>
<15463-6>
<14249-6>
<14076-4>
<10781-3>
<26478-3>
<16265-5>
<14765-2>
<10247-2>
<30100-6>
<18207-2>
<29669-2>
<29852-4>
<18089-3>
<10947-2>
<13413-3>
<11664-2>
<29084-2>
<27602-2>
<10242-5>
<19083-3>
<13301-0>
<29809-5>
<13474-4>
<13109-6>
<10008-6>
<15842-5>
<16594-0>
<19577-6>
<26772-3>
<19178-6>
<10798-0>
<191500>
<10156-5>
<18030-1>
<180739>
<30088-5>
<70932>
<13110-0>
<29612-3>
<14586-2>
<12274-3>
<11954-0>
<19612-2>
<18271-0>
<29695-1>
<14431-3>
<13667-0>
<11547-6>
<11151-3>
<12765-5>
<17413-4>
<19112-1>
<10147-6>
<180781>
<17660-1>
<18440-3>
<29672-6>
<16387-5>
<20206-3>
<14084-5>
<18627-1>
<189012>
<10207-0>
<16327-2>
<15684-4>
<10007-1>
<12940-6>
<14336-4>
<19333-6>
<14824-5>
<16743-2>
<11337-3>
<14421-6>
<29819-2>
<18936-2>
<30047-5>
<29908-3>
<16184-5>
<19292-1>
<29549-5>
<15837-5>
<10984-3>
<27423-2>
<10787-5>
<10813-2>
<12667-5>
<19691-1>
<16439-5>
<29502-3>
<26732-1>
<72185>
<28007-4>
<12881-3>
<12768-6>
<16476-6>
<10951-4>
<70070>
<14366-2>
<10241-0>
<11596-0>
<19442-1>
<13350-1>
<18752-5>
<30085-4>
<19070-5>
<12393-2>
<18348-5>
<12214-0>
<14023-4>
<10473-0>
<10021-0>
<15258-0>
<17750-0>
<29446-1>
<19098-4>
<26599-5>
<14396-0>
<18707-3>
<19805-5>
<18124-6>
<14270-1>
<29697-4>
<10598-1>
<12587-3>
<11698-6>
<18289-2>
<18006-5>
<13472-1>
<14157-4>
<11443-4>
<19272-0>
<14393-6>
<15062-3>
<29850-1>
<16542-5>
<19808-6>
<70227>
<11554-2>
<19544-0>
<18150-5>
<70358>
<19599-3>
<18251-6>
<17592-6>
<18712-3>
<29567-3>
<11416-0>
<29607-3>
<10628-4>
<16215-6>
<14919-1>
<20314-0>
<16533-6>
<14335-6>
<12921-3>
<17621-4>
<27589-3>
<29975-2>
<13841-3>
<11910-6>
<11735-5>
<18892-3>
<26786-6>
<180740>
<18142-4>
<17015-2>
<26705-4>
<15878-5>
<13605-1>
<17588-4>
<14060-5>
<13746-4>
<18773-4>
<29715-0>
<18203-3>
<12742-3>
<13077-0>
<19014-1>
<15722-1>
<19237-2>
<14151-2>
<26827-4>
<13825-1>
<15478-0>
<18614-3>
<29341-1>
<30029-0>
<29737-4>
<19374-6>
<15651-5>
<14211-3>
<29967-1>
<15624-1>
<19752-0>
<14296-4>
<16606-5>
<14437-5>
<73394>
<15729-1>
<12818-3>
<21011-6>
<18415-2>
<18340-0>
<30026-6>
<70881>
<24781-5>
<10979-3>
<10791-0>
<29727-0>
<19121-0>
<70257>
<29904-4>
<18584-0>
<12112-1>
<26101-1>
<26449-3>
<26210-3>
<17612-5>
<70871>
<19427-4>
<19678-0>
<26277-6>
<18555-0>
<19500-6>
<14273-2>
<70131>
<19388-2>
<10329-0>
<19370-0>
<12407-3>
<18573-5>
<10763-5>
<18297-3>
<14252-3>
<13248-6>
<18542-2>
<18509-0>
<18659-2>
<15916-2>
<10486-5>
<10987-4>
<15073-5>
<70241>
<17947-2>
<26330-0>
<10779-4>
<16699-0>
<14957-0>
<24663-4>
<70943>
<28634-5>
<19485-4>
<17927-1>
<70967>
<17610-2>
<30068-4>
<18678-5>
<11365-5>
<26376-4>
<14383-2>
<27914-4>
<13753-0>
<18587-1>
<26408-3>
<18295-0>
<70017>
<19390-1>
<16274-4>
<10216-6>
<29796-2>
<16052-1>
<11433-0>
<19022-2>
<18718-5>
<18133-5>
<16268-6>
<29234-2>
<175787>
<13784-3>
<15643-4>
<10612-5>
<29524-0>
<15787-1>
<11157-5>
<29802-5>
<10725-6>
<70964>
<19625-0>
<18475-5>
<16539-1>
<12580-3>
<13988-1>
<13727-1>
<13358-6>
<18927-3>
<11792-0>
<12028-4>
<15714-0>
<18861-0>
<19769-4>
<30080-0>
<13165-3>
<29826-5>
<30031-6>
<19715-6>
<10302-6>
<12997-5>
<29756-0>
<70342>
<18351-2>
<14281-3>
<70828>
<13337-0>
<13066-5>
<13019-0>
<16477-4>
<19605-6>
<19494-3>
<10647-0>
<18569-3>
<29545-6>
<15868-1>
<28667-4>
<70184>
<11708-1>
<29836-2>
<12209-0>
<15628-0>
<20110-2>
<19571-4>
<19755-1>
<24785-4>
<14623-1>
<16719-6>
<19125-6>
<17980-4>
<73367>
<13205-3>
<14144-6>
<70874>
<16037-4>
<10902-3>
<11724-3>
<30045-2>
<18277-2>
<12027-6>
<19033-4>
<18848-6>
<13807-3>
<p>
<29882-2>
<17745-0>
<10980-4>
<14337-2>
<15396-2>
<15376-1>
<14323-6>
<14627-0>
<16391-0>
<71116>
<19133-0>
<13801-1>
<17599-6>
<13962-5>
<17704-0>
<13385-3>
<70253>
<16595-5>
<70957>
<12218-6>
<19511-1>
<15055-0>
<70004>
<12090-6>
<17933-6>
<17583-0>
<12758-2>
<71064>
<10406-1>
<187370>
<11498-0>
<19010-2>
<19137-6>
<18803-0>
<16914-1>
<10199-1>
<10491-5>
<19216-3>
<13316-1>
<13239-0>
<19651-6>
<29327-2>
<70905>
<26708-5>
<16280-2>
<14515-4>
<13674-3>
<13594-1>
<29223-0>
<70852>
<12186-0>
<19562-5>
<18798-2>
<26250-5>
<29953-5>
<11966-0>
<19172-4>
<16362-0>
<15905-0>
<18760-6>
<11685-1>
<73303>
<14779-5>
<70212>
<13481-0>
<19145-0>
<29142-0>
<13714-3>
<28082-4>
<14298-0>
<13453-5>
<27113-3>
<12154-6>
<14472-3>
<10427-0>
<10455-2>
<18060-6>
<19306-2>
<10574-1>
<29589-0>
<19775-2>
<18984-5>
<19841-1>
<11123-1>
<29064-1>
<12046-2>
<16195-0>
<13050-6>
<12284-0>
<10567-5>
<180782>
<16067-2>
<71030>
<12452-5>
<29325-6>
<12294-4>
<15992-0>
<11049-1>
<10576-4>
<15399-3>
<15972-6>
<11326-1>
<19294-4>
<11304-4>
<15887-4>
<29673-4>
<17972-3>
<16727-0>
<10478-4>
<19332-1>
<18296-5>
<19428-2>
<15718-6>
<11400-1>
<12277-4>
<10041-1>
<17948-0>
<19365-0>
<18959-4>
<28782-4>
<15935-5>
<10137-2>
<11731-6>
<14139-6>
<70538>
<13234-3>
<29938-1>
<11258-6>
<13130-1>
<10115-5>
<13348-2>
<15709-0>
<71079>
<18022-0>
<12307-0>
<18258-6>
<11607-0>
<13390-3>
<18836-6>
<10685-6>
<28719-4>
<16441-4>
<11840-1>
<19668-3>
<18831-2>
<19817-5>
<15892-4>
<24621-6>
<10320-4>
<19027-6>
<19379-3>
<13242-4>
<19130-6>
<14789-2>
<16078-4>
<18105-3>
<12955-0>
<13492-2>
<12699-6>
<14796-5>
<18126-2>
<28854-5>
<72186>
<19418-5>
<10160-0>
<13154-1>
<11241-2>
<10623-0>
<19855-4>
<18090-4>
<19021-4>
<16035-1>
<70928>
<16214-1>
<15924-3>
<18118-1>
<11696-3>
<13534-5>
<16053-6>
<12009-1>
<19822-5>
<15089-4>
<15757-3>
<14171-3>
<19287-1>
<12155-4>
<19746-2>
<15839-1>
<18279-5>
<18378-3>
<19465-3>
<19203-5>
<13985-0>
<29798-5>
<12311-2>
<29995-3>
<12250-3>
<19323-2>
<20826-1>
<13992-3>
<29482-4>
<13583-6>
<19849-6>
<12302-3>
<29778-4>
<14507-3>
<16233-4>
<13691-3>
<10150-3>
<16191-1>
<17935-2>
<17161-5>
<16295-3>
<29655-6>
<12961-5>
<19559-1>
<18232-3>
<70036>
<16990-6>
<11066-1>
<10091-0>
<17792-5>
<19435-5>
<19576-1>
<11825-4>
<19445-2>
<18226-5>
<13490-6>
<19832-2>
<15107-0>
<18337-3>
<15674-0>
<15397-0>
<10315-4>
<29323-3>
<11379-1>
<19643-5>
<70424>
<14035-4>
<15491-1>
<71083>
<12619-2>
<19902-0>
<17374-2>
<13046-4>
<29818-4>
<16120-3>
<70539>
<10698-4>
<14603-0>
<13827-4>
<19521-5>
<29817-6>
<11687-4>
<18608-5>
<16353-1>
<13264-1>
<18522-1>
<15408-0>
<19269-3>
<10821-3>
<18915-3>
<11895-4>
<11180-3>
<30106-1>
<12040-0>
<18510-1>
<16516-6>
<11030-1>
<18592-1>
<15734-1>
<70055>
<70959>
<29921-4>
<19697-3>
<13033-6>
<18593-6>
<18869-5>
<15720-5>
<18261-3>
<13525-6>
<12217-1>
<11710-0>
<15727-5>
<26678-2>
<12035-0>
<10675-2>
<13708-5>
<16502-3>
<14094-2>
<14927-2>
<16927-6>
<11302-1>
<29771-4>
<18935-4>
<15654-6>
<10227-1>
<29081-1>
<12418-5>
<12408-1>
<13379-5>
<17959-2>
<12842-6>
<29865-2>
<19162-0>
<18284-5>
<10236-0>
<16449-2>
<13303-3>
<19569-5>
<12966-2>
<19759-0>
<15126-3>
<16395-6>
<10293-2>
<19814-4>
<29572-3>
<26309-5>
<180780>
<12729-2>
<11677-0>
<19807-1>
<17039-2>
<14024-2>
<10424-6>
<13278-4>
<13158-0>
<15715-5>
<70990>
<70924>
<29919-5>
<10313-1>
<19495-1>
<14195-3>
<10757-0>
<10956-1>
<30048-3>
<11772-6>
<14272-4>
<12978-2>
<10908-5>
<13309-5>
<70060>
<14554-1>
<19416-2>
<12087-2>
<70939>
<70135>
<70947>
<11962-1>
<18209-5>
<19796-1>
<14065-2>
<18982-2>
<11975-6>
<13229-3>
<29660-6>
<13729-4>
<13844-4>
<70085>
<10265-0>
<13635-6>
<19591-5>
<12755-1>
<10170-4>
<13466-3>
<180784>
<18109-2>
<10490-0>
<19456-4>
<16826-5>
<16551-4>
<26069-6>
<19397-1>
<13475-2>
<29752-1>
<19738-1>
<11633-6>
<18162-5>
<70179>
<30069-2>
<19834-5>
<30004-2>
<194781>
<12180-5>
<11718-5>
<13360-5>
<10064-3>
<19405-0>
<13081-2>
<29580-4>
<12185-2>
<16531-3>
<15488-4>
<27198-4>
<29684-6>
<14295-6>
<13894-3>
<15458-6>
<71096>
<10043-4>
<19801-6>
<29668-4>
<24733-2>
<11200-2>
<13457-4>
<13173-4>
<13023-2>
<10383-1>
<13647-6>
<17471-4>
<18758-0>
<12711-0>
<12108-6>
<18250-1>
<11993-4>
<10463-3>
<19462-2>
<19242-2>
<30039-4>
<11534-1>
<15725-2>
<12216-3>
<19750-4>
<17255-3>
<18168-0>
<11661-1>
<18688-2>
<29622-0>
<28521-4>
<11504-3>
<16275-2>
<18313-3>
<18876-1>
<16554-5>
<19509-2>
<14731-5>
<26601-2>
<19174-0>
<17914-3>
<18309-1>
<17630-3>
<29600-3>
<12511-1>
<14911-3>
<10498-5>
<11646-4>
<10649-3>
<16514-3>
<15664-3>
<29909-1>
<28227-4>
<18601-5>
<10249-5>
<19640-4>
<28237-1>
<10876-6>
<14106-0>
<14217-5>
<13813-1>
<11703-4>
<14101-3>
<11679-3>
<13530-6>
<18390-6>
<27853-5>
<19211-6>
<14051-6>
<29603-4>
<18073-4>
<30007-3>
<29923-0>
<19220-5>
<16716-5>
<30109-2>
<72394>
<14124-5>
<26582-1>
<10209-3>
<18863-3>
<30091-2>
<15695-6>
<10822-1>
<18856-0>
<13330-0>
<17772-4>
<17597-3>
<11669-6>
<29101-0>
<19280-1>
<14063-6>
<12091-4>
<10621-4>
<14895-3>
<26328-1>
<18934-6>
<11167-2>
<12693-4>
<19156-2>
<18350-4>
<10327-4>
<14432-1>
<13656-5>
<17567-5>
<71072>
<19560-2>
<20321-3>
<10161-5>
<19502-2>
<19087-2>
<18132-0>
<17985-1>
<14150-4>
<15731-0>
<12730-3>
<20306-6>
<10256-1>
<26584-4>
<13045-6>
<19036-5>
<18434-5>
<10772-4>
<14118-0>
<17773-2>
<10728-0>
<10907-0>
<12051-2>
<26602-0>
<16102-5>
<10202-3>
<18553-4>
<15598-4>
<70817>
<15074-3>
<10401-4>
<13964-1>
<28001-2>
<29992-2>
<18125-4>
<13845-2>
<10204-6>
<29878-0>
<19480-0>
<19747-0>
<19541-6>
<10348-3>
<70853>
<11339-6>
<194780>
<26760-3>
<14088-4>
<18163-3>
<71057>
<16336-1>
<29657-2>
<70372>
<14772-5>
<20733-1>
<13684-0>
<70095>
<19689-2>
<18493-3>
<70549>
<26177-3>
<11872-2>
<13712-0>
<30055-6>
<15717-1>
<18717-0>
<10604-4>
<18741-3>
<29978-3>
<11479-4>
<10243-3>
<10374-2>
<29228-4>
<71037>
<18996-5>
<18686-6>
<10440-1>
<25965-4>
<29714-2>
<70844>
<19367-3>
<26178-1>
<11651-4>
<13462-4>
<72181>
<11932-3>
<19604-1>
<29696-6>
<10617-2>
<10641-5>
<18766-1>
<29553-0>
<19396-3>
<19791-4>
<29638-6>
<12665-2>
<17922-4>
<29932-6>
<11678-5>
<18652-2>
<15682-1>
<29301-6>
<13874-2>
<14308-2>
<14995-6>
<71014>
<71055>
<13247-1>
<70086>
<15555-1>
<19664-4>
<19223-6>
<29717-3>
<70057>
<10145-3>
<20289-1>
<17799-5>
<17787-5>
<12326-3>
<11660-3>
<18450-0>
<12489-3>
<13329-6>
<19529-3>
<29710-3>
<14909-4>
<19688-4>
<14984-4>
<15021-3>
<12508-4>
<29062-5>
<29981-0>
<28551-2>
<12897-2>
<13433-4>
<18356-6>
<12668-3>
<70154>
<16526-3>
<11927-3>
<19694-2>
<71042>
<10622-2>
<13415-6>
<12174-0>
<29911-0>
<13501-6>
<13513-6>
<11036-3>
<19629-6>
<11610-4>
<13633-3>
<10381-5>
<26197-4>
<11436-1>
<73378>
<29928-4>
<10546-6>
<19633-1>
<19784-1>
<11532-5>
<29707-6>
<30020-4>
<14066-0>
<14095-0>
<19271-2>
<10166-2>
<12055-1>
<10561-3>
<29244-6>
<18956-3>
<13282-6>
<14722-6>
<19290-5>
<29281-0>
<18092-0>
<29563-4>
<13650-3>
<70989>
<12721-4>
<19729-2>
<10586-1>
<19408-1>
<18805-3>
<12598-5>
<10910-4>
<21101-5>
<18254-0>
<29939-6>
<16974-4>
<19035-0>
<15897-1>
<11999-6>
<13565-1>
<16143-5>
<30012-3>
<17669-4>
<29758-3>
<15755-0>
<16989-5>
<18690-1>
<19208-2>
<12798-4>
<12523-1>
<12617-6>
<18292-6>
<73344>
<12631-5>
<11181-1>
<10342-1>
<16140-4>
<14107-5>
<18149-4>
<15859-2>
<14804-4>
<15362-5>
<13671-2>
<11207-2>
<19557-5>
<17700-1>
<19337-5>
<29834-6>
<11539-5>
<18546-1>
<29658-0>
<29615-4>
<13296-2>
<19503-0>
<15704-3>
<13320-3>
<17464-1>
<26085-1>
<14184-1>
<10614-1>
<70814>
<19044-6>
<19764-0>
<30046-0>
<11459-3>
<14353-4>
<26733-6>
<19200-4>
<71075>
<14293-3>
<19157-0>
<12296-0>
<73358>
<19100-1>
<19656-3>
<26642-2>
<29602-6>
<26292-3>
<10713-6>
<14831-1>
<14513-1>
<11294-2>
<14651-3>
<71006>
<13421-4>
<12983-2>
<11986-1>
<71119>
<17626-1>
<11211-4>
<18173-0>
<29996-1>
<16959-0>
<19179-4>
<18583-2>
<18822-3>
<29961-6>
<19525-4>
<10510-6>
<10466-4>
<18160-2>
<29770-6>
<29521-6>
<26805-0>
<10523-4>
<17800-4>
<a>
<29764-1>
<17954-5>
<29759-1>
<12915-5>
<10151-1>
<70467>
<17779-4>
<19780-2>
<70151>
<26447-0>
<18847-1>
<19610-6>
<15806-2>
<11894-6>
<18410-5>
<197189>
<26520-2>
<29381-3>
<10215-1>
<10894-4>
<19409-6>
<16258-2>
<19836-1>
<30077-3>
<29569-6>
<10506-4>
<12195-6>
<12914-0>
<13397-3>
<18808-4>
<29966-3>
<14357-3>
<28373-0>
<70254>
<70028>
<18108-4>
<29629-0>
<26251-3>
<18938-5>
<19360-3>
<10076-3>
<30003-4>
<16912-5>
<15405-6>
<14442-5>
<11170-6>
<29667-6>
<19134-5>
<19568-0>
<19001-3>
<29619-3>
<14266-6>
<16150-1>
<27842-3>
<10350-2>
<13862-2>
<11248-2>
<15876-2>
<10626-1>
<12187-5>
<19186-0>
<14958-5>
<16278-3>
<70891>
<16985-6>
<11478-6>
<15054-2>
<18229-6>
<70573>
<17623-0>
<13063-4>
<19152-3>
<11034-0>
<16110-6>
<19256-5>
<13067-3>
<73388>
<29808-0>
<18872-2>
<14449-5>
<196981>
<19278-2>
<11783-1>
<16204-4>
<15752-6>
<19645-1>
<29886-1>
<18122-3>
<11526-0>
<12497-4>
<29883-0>
<18074-2>
<14269-0>
<29685-4>
<18461-2>
<13563-5>
<18519-4>
<10834-1>
<12809-4>
<26598-0>
<19636-2>
<15798-3>
<12025-3>
<16322-5>
<15679-4>
<14186-4>
<16761-0>
<17937-5>
<17990-1>
<14980-5>
<13465-5>
<13253-6>
<29662-2>
<185787>
<16550-6>
<11217-6>
<18130-4>
<16188-4>
<11652-2>
<26070-0>
<15117-4>
<15483-0>
<15642-6>
<19754-3>
<10410-3>
<16338-4>
<29806-4>
<15648-1>
<70134>
<13444-6>
<19590-0>
<73340>
<11185-0>
<13297-0>
<17627-6>
<16815-3>
<29643-6>
<16416-3>
<15807-0>
<182540>
<13780-4>
<18339-6>
<70851>
<11903-3>
<18666-5>
<10827-5>
<19170-1>
<14215-2>
<16541-0>
<18647-2>
<17175-1>
<19085-6>
<18204-1>
<24857-5>
<19779-1>
<18860-2>
<19583-4>
<30019-3>
<12255-0>
<185840>
<19118-3>
<10735-3>
<15467-5>
<17707-1>
<16013-4>
<73382>
<18821-5>
<70328>
<16440-6>
<12919-4>
<13420-6>
<70052>
<11613-5>
<19709-1>
<29708-4>
<14413-5>
<27909-4>
<14161-6>
<16749-4>
<30032-4>
<14190-6>
<16769-5>
<13037-5>
<29678-1>
<19398-6>
<11152-1>
<26499-2>
<26539-2>
<10866-2>
<18054-1>
<14030-0>
<18005-0>
<11721-2>
<19090-6>
<11965-2>
<13057-6>
<30079-6>
<29711-1>
<11586-3>
<19810-5>
<18154-4>
<19097-6>
<29900-5>
<27985-2>
<12509-2>
<12356-1>
<70066>
<16201-3>
<12868-2>
<13170-3>
<14900-1>
<18985-3>
<19554-4>
<73356>
<16623-5>
<12502-2>
<16299-2>
<11688-2>
<19774-4>
<16969-4>
<26072-3>
<26830-1>
<12135-3>
<19184-4>
<16480-1>
<10501-0>
<14543-6>
<18733-2>
<70021>
<13294-6>
<26757-6>
<11238-5>
<18492-5>
<15072-0>
<19034-2>
<29628-2>
<29804-1>
<12171-6>
<15918-5>
<18905-6>
<18979-5>
<10382-3>
<26176-5>
<15995-1>
<15904-2>
<19150-0>
<16509-3>
<30021-2>
<72182>
<19311-2>
<13639-5>
<10141-4>
<18155-2>
<17724-1>
<19214-0>
<10197-5>
<11592-1>
<14527-4>
<12058-2>
<18739-4>
<17934-4>
<29955-1>
<12898-0>
<11682-0>
<70041>
<18424-1>
<19508-4>
<30105-3>
<18810-3>
<71065>
<19226-0>
<10307-3>
<29703-0>
<70130>
<12314-3>
<11262-1>
<11124-6>
<15712-4>
<27687-3>
<29838-5>
<18176-1>
<15903-4>
<10263-4>
<13851-0>
<14601-4>
<13555-4>
<10347-5>
<11706-5>
<18775-0>
<18311-0>
<15125-5>
<12432-4>
<18748-3>
<11397-6>
<16301-6>
<19555-2>
<29774-5>
<14567-6>
<18028-2>
<28080-1>
<29522-4>
<12942-2>
<15064-6>
<15149-5>
<11994-2>
<12215-5>
<71061>
<26147-5>
<27390-5>
<11559-6>
<71069>
<14634-3>
<194331>
<10659-0>
<12247-6>
<27590-4>
<19518-1>
<17485-0>
<12019-5>
<70873>
<26276-1>
<19523-1>
<10460-2>
<27291-0>
<18755-6>
<70477>
<15675-5>
<11880-3>
<13967-2>
<29849-0>
<28657-0>
<16602-6>
<11299-6>
<18518-6>
<29321-0>
<70960>
<19756-6>
<70941>
<14762-1>
<13411-0>
<26131-6>
<16535-2>
<29689-3>
<17570-2>
<29914-1>
<19086-4>
<18672-3>
<15075-1>
<11043-6>
<12423-5>
<12936-4>
<19552-1>
<12621-1>
<14769-1>
<16683-1>
<10537-0>
<18444-2>
<19532-0>
<14021-1>
<19815-2>
<10481-1>
<17991-6>
<13102-6>
<10904-6>
<13632-5>
<10495-4>
<29556-1>
<14724-2>
<21315-0>
<18635-2>
<16547-2>
<15730-2>
<16397-2>
<11803-0>
<17742-6>
<12749-3>
<15860-3>
<18324-5>
<70956>
<11378-3>
<19257-3>
<30017-0>
<19069-4>
<29402-0>
<15988-5>
<18167-2>
<10994-0>
<12021-4>
<19707-5>
<27587-0>
<18729-0>
<13402-1>
<15033-3>
<13811-5>
<12863-5>
<186754>
<10246-4>
<73363>
<12808-6>
<16417-1>
<27878-3>
<20341-4>
<18890-0>
<10525-0>
<14102-1>
<29626-6>
<29846-6>
<71102>
<12574-5>
<11541-4>
<13816-2>
<11268-3>
<10305-0>
<71031>
<14127-6>
<10945-6>
<28664-3>
<16668-4>
<70481>
<15411-4>
<12816-0>
<15633-0>
<26275-3>
<11278-0>
<19176-3>
<13703-1>
<71009>
<15767-0>
<29551-4>
<29235-0>
<11663-4>
<24705-0>
<10012-1>
<70819>
<10122-1>
<19572-2>
<19192-5>
<11723-5>
<30054-1>
<18788-5>
<12930-2>
<14123-0>
<197727>
<13299-3>
<10714-4>
<70020>
<10088-3>
<15923-5>
<10497-0>
<17500-2>
<18691-6>
<18370-5>
<11293-4>
<15176-2>
<18489-1>
<29610-0>
<10973-1>
<13400-5>
<19646-6>
<30058-0>
<18341-5>
<18653-0>
<19498-2>
<29920-6>
<10159-6>
<16298-4>
<15676-3>
<11974-1>
<19062-4>
<29561-1>
<19787-2>
<71080>
<16497-5>
<19672-5>
<11628-6>
<27928-0>
<16853-2>
<11627-1>
<12967-0>
<30053-3>
<19297-5>
<19327-1>
<70039>
<30082-3>
<15713-2>
<18083-1>
<15920-4>
<13762-6>
<18025-1>
<19217-1>
<29888-4>
<19305-4>
<20817-2>
<29744-0>
<11742-1>
<16730-4>
<12138-4>
<12016-4>
<13687-1>
<10668-6>
<10683-3>
<71111>
<15711-6>
<29816-1>
<13510-5>
<19673-3>
<10562-1>
<19454-1>
<15932-4>
<19722-2>
<14119-5>
<18397-6>
<30072-6>
<17607-5>
<19676-4>
<18140-1>
<70486>
<13636-4>
<70148>
<15678-6>
<29686-2>
<15694-1>
<16898-1>
<29441-4>
<29598-6>
<18197-0>
<29844-3>
<14810-2>
<16090-0>
<70855>
<18357-4>
<11391-4>
<18702-6>
<18673-1>
<12724-5>
<19705-2>
<13155-6>
<29227-6>
<13488-0>
<19274-3>
<18375-2>
<15067-0>
<18759-5>
<14110-2>
<13587-5>
<19574-5>
<16489-4>
<28938-6>
<11863-3>
<13974-5>
<15902-6>
<19142-6>
<10527-3>
<12770-5>
<10000-1>
<12120-2>
<15926-6>
<18987-6>
<26758-4>
<18830-4>
<29868-3>
<15605-5>
<16745-5>
<29692-0>
<19366-5>
<18649-5>
<17988-2>
<16615-4>
<13470-5>
<70080>
<13666-2>
<26162-2>
<13584-4>
<16588-2>
<10968-1>
<29755-2>
<16977-5>
<11779-6>
<15416-1>
<13295-4>
<18900-2>
<29501-5>
<30037-1>
<10842-2>
<12396-3>
<11765-3>
<14537-1>
<14997-2>
<70476>
<18541-4>
<10511-4>
<11666-5>
<12072-1>
<71074>
<17950-6>
<73295>
<11774-2>
<27737-0>
<19348-0>
<13200-6>
<16483-2>
<194454>
<11847-1>
<18029-0>
<71099>
<30013-1>
<73333>
<14581-5>
<11059-5>
<11060-6>
<70265>
<29691-2>
<19504-5>
<70051>
<18129-3>
<12106-3>
<70143>
<26679-0>
<16768-0>
<13644-5>
<16406-6>
<29847-4>
<13424-5>
<10472-2>
<10121-3>
<19711-0>
<29825-0>
<18456-2>
<10172-0>
<11636-0>
<11165-6>
<11702-6>
<10807-4>
<14964-3>
<19029-2>
<13389-2>
<17785-2>
<12823-3>
<29226-1>
<28813-5>
<10062-0>
<14188-0>
<19291-3>
<29443-0>
<18070-3>
<70341>
<18505-1>
<73354>
<15790-5>
<14081-4>
<14032-3>
<13341-2>
<10120-5>
<16782-6>
<18107-6>
<26377-2>
<18598-3>
<18227-3>
<29732-0>
<19628-1>
<11353-5>
<10991-6>
<12249-2>
<18929-6>
<19770-5>
<70897>
<16951-2>
<12069-4>
<71043>
<16709-2>
<14464-2>
<11782-3>
<11064-5>
<18770-3>
<16048-6>
<19763-2>
<12368-1>
<29750-5>
<16740-1>
<16342-6>
<186755>
<18671-5>
<26554-6>
<70429>
<14346-1>
<19733-4>
<28213-1>
<15793-6>
<13058-4>
<19182-1>
<13473-6>
<71067>
<15476-4>
<10353-3>
<16267-1>
<26620-5>
<16438-0>
<18658-4>
<29728-5>
<15708-2>
<16030-4>
<10462-5>
<11213-0>
<13570-1>
<11900-2>
<17676-0>
<18372-1>
<10075-5>
<70087>
<19573-0>
<29971-3>
<30066-1>
<19580-3>
<29785-0>
<16601-1>
<19245-3>
<13416-4>
<19455-6>
<18117-3>
<28951-0>
<11192-3>
<18916-1>
<19340-2>
<13723-2>
<13096-3>
<12525-4>
<13953-6>
<17727-2>
<14738-5>
<70245>
<10631-1>
<12241-4>
<29575-4>
<29969-4>
<18703-4>
<10764-3>
<10524-2>
<10081-3>
<19377-0>
<14923-3>
<16226-1>
<19229-1>
<10138-0>
<29523-2>
<18320-6>
<29927-6>
<13694-4>
<19804-0>
<14436-0>
<15721-3>
<11438-4>
<12030-3>
<30028-2>
<11411-3>
<11988-4>
<70300>
<13511-3>
<16946-2>
<19169-0>
<13372-5>
<26193-5>
<10828-3>
<12782-5>
<10548-2>
<19766-3>
<13839-4>
<27348-4>
<16481-6>
<13202-2>
<19385-1>
<11665-0>
<14833-4>
<21014-0>
<18193-1>
<18855-2>
<14245-0>
<19284-0>
<13429-2>
<14214-4>
<13371-0>
<26600-4>
<13142-1>
<26434-2>
<18991-1>
<29621-2>
<15821-6>
<11183-4>
<14428-6>
<10433-5>
<10718-3>
<12713-3>
<16970-5>
<70839>
<29979-1>
<12577-6>
<11990-3>
<12689-2>
<19809-4>
<19122-5>
<12810-5>
<29916-4>
<12252-6>
<16429-1>
<29722-3>
<18537-2>
<10852-6>
<29083-4>
<28807-0>
<11177-6>
<26226-2>
<196997>
<29781-1>
<194088>
<11582-4>
<10884-0>
<29977-5>
<190023>
<11806-1>
<14433-6>
<16019-6>
<13164-5>
<18995-0>
<26021-6>
<10488-1>
<12050-4>
<10940-2>
<18709-6>
<30110-3>
<10016-0>
<15640-3>
<29709-2>
<18899-3>
<13214-2>
<18421-0>
<29633-2>
<73345>
<15981-5>
<19594-6>
<12980-1>
<11530-2>
<29577-0>
<13188-5>
<19096-1>
<26248-6>
<14906-3>
<18065-3>
<19239-5>
<26553-1>
<18270-2>
<19344-1>
<12648-2>
<16493-6>
<11065-3>
<11460-4>
<10899-1>
<16664-5>
<10704-0>
<14174-4>
<13731-3>
<29993-0>
<70310>
<70141>
<16564-2>
<29741-6>
<11740-5>
<26784-3>
<14788-4>
<17928-6>
<12116-0>
<29642-1>
<15744-5>
<29985-6>
<18358-2>
<14516-2>
<73364>
<10038-4>
<26583-6>
<13215-0>
<18084-6>
<14149-3>
<12903-5>
<18187-3>
<16544-1>
<18503-5>
<26828-2>
<18897-0>
<71089>
<26150-2>
<10475-3>
<10615-6>
<27571-1>
<71045>
<29842-0>
<12801-6>
<19386-6>
<15683-6>
<12015-6>
<29302-4>
<12901-2>
<13002-3>
<14473-1>
<29910-2>
<14173-6>
<15066-2>
<18966-0>
<14792-6>
<15912-3>
<19026-1>
<70049>
<15616-0>
<29322-5>
<29890-3>
<11303-6>
<17634-2>
<13306-4>
<19375-4>
<19745-4>
<12708-3>
<28834-4>
<30008-1>
<15773-5>
<24859-1>
<28542-3>
<11591-3>
<29543-3>
<19488-5>
<16954-3>
<70040>
<12848-1>
<29616-2>
<11434-5>
<19459-5>
<73336>
<29784-2>
<19330-5>
<29860-5>
<73380>
<24708-1>
<26246-3>
<10031-4>
<19512-6>
<19563-3>
<10045-0>
<19458-0>
<13376-4>
<70005>
<29738-2>
<29855-5>
<29821-1>
<16543-3>
<11389-5>
<18654-5>
<26646-1>
<71066>
<71113>
<11850-5>
<19313-5>
<17571-0>
<11727-4>
<15320-0>
<13409-1>
<18970-2>
<17790-2>
<30111-1>
<15104-6>
<12119-1>
<26826-6>
<11572-0>
<18859-1>
<19851-5>
<26358-6>
<73346>
<19151-5>
<16639-4>
<71059>
<29597-1>
<11194-6>
<14355-0>
<18328-4>
<71032>
<29646-0>
<15336-6>
<19354-5>
<29885-3>
<27358-1>
<12256-5>
<12941-4>
<12175-5>
<19548-6>
<10471-4>
<10027-2>
<18971-0>
<26859-5>
<16603-4>
<11305-2>
<18262-1>
<13072-3>
<18842-4>
<26209-2>
<15769-3>
<29641-3>
<26333-1>
<26129-0>
<10500-2>
<19749-3>
<13519-1>
<71097>
<10808-2>
<18020-4>
<18705-0>
<11943-5>
<13709-3>
<12024-5>
<16943-1>
<19431-6>
<17982-0>
<29224-5>
<15225-1>
<10001-6>
<17016-0>
<19319-0>
<15909-6>
<15735-6>
<29952-0>
<197981>
<11083-1>
<17666-3>
<17943-3>
<19268-5>
<30011-5>
<73384>
<14889-5>
<10002-4>
<29739-0>
<13496-1>
<12384-3>
<10789-1>
<14359-6>
<18097-4>
<18237-0>
<19624-2>
<19858-5>
<70931>
<14074-1>
<11236-2>
<26208-4>
<19166-6>
<14483-5>
<18874-5>
<17703-2>
<12777-5>
<14776-4>
<11051-0>
<16849-0>
<29141-2>
<29746-3>
<19535-1>
<11970-2>
<19212-4>
<18183-4>
<28202-6>
<10556-3>
<13516-0>
<16043-2>
<11325-3>
<13349-0>
<10891-3>
<12985-5>
<15025-2>
<16402-0>
<26291-5>
<70952>
<13498-4>
<16717-3>
<18889-6>
<71019>
<14096-5>
<12794-5>
<18833-5>
<14279-4>
<19857-0>
<30061-4>
<10975-4>
<16948-5>
<12847-3>
<18281-4>
<10619-5>
<11807-6>
<29591-6>
<15470-2>
<17723-3>
<17593-4>
<11934-6>
<18151-3>
<15835-2>
<18344-6>
<12303-1>
<29994-5>
<30074-2>
<16366-6>
<18891-5>
<11525-2>
<29679-6>
<14899-2>
<18948-2>
<18867-2>
<29797-0>
<10459-1>
<73395>
<18747-5>
<196876>
<16059-1>
<13327-3>
<12436-3>
<19596-2>
<17589-2>
<14381-6>
<29893-4>
<29550-6>
<175786>
<70239>
<70969>
<30036-3>
<18156-0>
<14512-3>
<73361>
<17706-3>
<27952-3>
<10267-3>
<11422-5>
<19437-1>
<29782-6>
<10696-1>
<19725-3>
<29805-6>
<18495-6>
<14934-5>
<19662-1>
<12917-1>
<29594-0>
<15327-0>
<13181-5>
<30090-4>
<19430-1>
<18382-5>
<70829>
<12085-6>
<11414-4>
<19627-3>
<11061-4>
<13026-3>
<11125-4>
<13401-3>
<14920-2>
<15429-6>
<19114-4>
<18195-4>
<70892>
<17919-0>
<30065-3>
<17534-6>
<14936-1>
<13095-5>
<18332-6>
<70933>
<13051-4>
<11055-6>
<70180>
<19724-5>
<18211-4>
<19641-2>
<19007-5>
<18638-3>
<12282-4>
<12419-3>
<11235-4>
<19040-0>
<18318-0>
<19467-6>
<26103-4>
<29854-0>
<12057-4>
<19667-5>
<15009-0>
<70056>
<26541-1>
<30000-3>
<14538-6>
<14380-1>
<11626-3>
<11377-5>
<28541-5>
<30092-0>
<15873-1>
<18236-2>
<19032-6>
<17480-3>
<29587-4>
<14821-4>
<18198-5>
<70923>
<20449-5>
<10854-2>
<10771-6>
<26071-5>
<29896-5>
<26585-2>
<12325-5>
<28414-5>
<10761-2>
<19479-6>
<11186-5>
<70046>
<13452-0>
<30071-1>
<70007>
<26311-4>
<14665-6>
<12276-6>
<18409-4>
<12719-5>
<12750-4>
<19526-2>
<11589-4>
<16187-6>
<14945-0>
<18166-4>
<17198-3>
<15057-3>
<17686-4>
<18426-4>
<13440-0>
<18772-6>
<17746-5>
<20810-2>
<15604-0>
<13660-0>
<13117-0>
<29866-0>
<13984-2>
<19793-0>
<12271-2>
<14916-0>
<21082-4>
<11484-4>
<19606-4>
<70186>
<29913-3>
<18248-2>
<19209-0>
<19219-4>
<11048-3>
<11264-4>
<70175>
<14194-5>
<70940>
<26555-4>
<30002-6>
<26731-3>
<26706-2>
<13210-3>
<70811>
<29984-1>
<19077-5>
<19781-0>
<12585-0>
<70581>
<26519-1>
<13485-6>
<29940-0>
<24740-5>
<29656-4>
<13574-0>
<10438-2>
<18784-6>
<70096>
<29559-2>
<10499-3>
<27621-5>
<15951-0>
<70816>
<19760-1>
<14602-2>
<15026-0>
<29609-6>
<12727-6>
<12876-3>
<10376-5>
<16411-6>
<16196-5>
<20722-6>
<18170-6>
<18782-3>
<19844-2>
<13224-6>
<29448-4>
<20399-1>
<19392-4>
<11266-0>
<11555-0>
<29793-1>
<10865-4>
<20491-6>
<29481-6>
<11233-1>
<11722-0>
<19631-5>
<29675-0>
<10006-3>
<13236-6>
<27902-4>
<11501-2>
<19635-4>
<29987-2>
<16051-3>
<11569-3>
<13083-5>
<70031>
<10186-3>
<16549-5>
<12669-1>
<70013>
<11691-6>
<13279-2>
<14343-0>
<18685-1>
<19639-3>
<15963-0>
<18010-0>
<27199-2>
<10986-6>
<194661>
<19072-1>
<11373-6>
<71063>
<14522-0>
<13333-1>
<12204-3>
<11111-1>
<13553-1>
<29895-0>
<10253-0>
<16978-3>
<14274-0>
<18701-1>
<16004-5>
<29725-4>
<18013-1>
<194843>
<12990-5>
<17726-4>
<19686-1>
<15765-4>
<19507-6>
<11529-1>
<19772-1>
<70818>
<19845-0>
<15696-4>
<29652-5>
<16809-5>
<14422-4>
<11290-3>
<14122-2>
<15272-6>
<28130-5>
<18903-3>
<18165-6>
<10550-1>
<18977-2>
<14723-4>
<10565-2>
<18088-5>
<17177-4>
<16684-6>
<19300-0>
<26475-2>
<10224-0>
<13249-4>
<20842-3>
<10300-3>
<26344-3>
<13702-3>
<18072-6>
<15381-1>
<19616-1>
<16496-0>
<10182-4>
<70182>
<13794-0>
<19273-5>
<19828-0>
<73357>
<11160-2>
<29787-3>
<29941-5>
<19051-2>
<13431-1>
<18828-5>
<14683-4>
<14851-2>
<19347-2>
<29328-0>
<18561-5>
<30056-4>
<10274-6>
<14902-4>
<12832-2>
<14001-0>
<70557>
<11713-1>
<29918-0>
<12958-1>
<70882>
<10089-1>
<10835-6>
<11191-5>
<18098-2>
<11684-3>
<17938-3>
<12514-2>
<19806-3>
<16754-4>
<19798-4>
<12788-0>
<12923-6>
<15858-4>
<16329-5>
<19846-5>
<70996>
<13199-0>
<18704-2>
<19527-0>
<19853-1>
<19788-0>
<10208-5>
<14732-3>
<12446-0>
<15825-5>
<29688-5>
<16696-6>
<18180-3>
<11309-1>
<29201-3>
<18059-5>
<10465-6>
<13364-4>
<18898-5>
<14354-2>
<19071-3>
<71003>
<18835-1>
<19073-6>
<14054-0>
<18793-5>
<12778-3>
<12111-3>
<14962-0>
<21282-3>
<18684-3>
<13355-5>
<10785-2>
<13713-5>
<71034>
<16112-2>
<14193-0>
<17011-3>
<18131-2>
<12121-0>
<12564-1>
<18139-0>
<19603-3>
<15264-5>
<13225-4>
<12656-3>
<18540-6>
<14954-6>
<15917-0>
<18177-6>
<12177-1>
<13960-2>
<19824-1>
<11490-2>
<10287-4>
<10179-0>
<70562>
<19578-4>
<10587-6>
<15211-5>
<29835-4>
<18143-2>
<29859-4>
<26211-1>
<13726-3>
<18623-2>
<10638-1>
<11869-5>
<18490-2>
<10162-3>
<14733-1>
<10054-6>
<11369-4>
<19383-5>
<15609-4>
<16841-2>
<18081-5>
<71028>
<19246-1>
<11853-6>
<29731-2>
<29620-4>
<10470-6>
<18926-5>
<10605-2>
<30094-3>
<27873-6>
<19189-1>
<12935-6>
<11197-0>
<10312-3>
<17181-6>
<18184-2>
<11580-1>
<26759-2>
<15448-2>
<14487-4>
<10515-3>
<15889-0>
<16039-0>
<16332-2>
<15372-2>
<11609-3>
<12705-2>
<12891-0>
<10439-0>
<18698-6>
<18517-1>
<11811-1>
<18591-3>
<13799-4>
<10944-1>
<16605-0>
<18538-0>
<11101-4>
<17748-1>
<70872>
<13627-5>
<19538-2>
<13441-5>
<27331-0>
<18750-2>
<18557-3>
<29584-3>
<70002>
<27097-3>
<13499-2>
<17618-0>
<24856-0>
<14455-3>
<18937-0>
<15811-2>
<11271-0>
<189969>
<70438>
<19757-4>
<11253-2>
<19387-4>
<18820-0>
<19193-3>
<12681-4>
<18865-6>
<16960-1>
<19592-3>
<10255-3>
<70327>
<15861-1>
<12644-3>
<70572>
<70965>
<14854-3>
<13575-5>
<14611-1>
<17665-5>
<15895-5>
<13804-2>
<16333-0>
<16868-3>
<29968-6>
<29590-1>
<13362-1>
<15968-4>
<29789-6>
<20022-6>
<12275-1>
<16373-2>
<29558-4>
<15753-4>
<29867-5>
<12182-1>
<30070-3>
<10949-5>
<16629-0>
<14083-0>
<18734-0>
<16297-6>
<26362-1>
<13766-5>
<27630-4>
<15771-2>
<73379>
<18112-6>
<73352>
<15063-1>
<18371-3>
<26523-3>
<11531-0>
<13693-6>
<15023-6>
<10717-5>
<70176>
<12865-1>
<14822-2>
<11959-4>
<16273-6>
<27185-6>
<15375-3>
<19565-6>
<71036>
<14237-6>
<29231-1>
<10616-4>
<11481-3>
<12010-2>
<70575>
<70071>
<15894-0>
<16080-3>
<14725-0>
<29768-0>
<25743-1>
<18667-3>
<16475-1>
<19309-3>
<26480-2>
<16026-2>
<18655-3>
<19079-1>
<19473-4>
<29869-1>
<11681-2>
<29810-6>
<18975-6>
<14794-2>
<13069-6>
<15946-0>
<11855-2>
<16874-1>
<10625-3>
<11545-3>
<29578-5>
<19231-0>
<11206-4>
<70938>
<11154-4>
<16087-3>
<11736-3>
<15738-0>
<18431-4>
<17978-5>
<73375>
<13250-5>
<29830-0>
<11052-5>
<29232-6>
<70471>
<70560>
<19706-0>
<11616-6>
<14450-6>
<13370-2>
<18911-4>
<29649-1>
<70120>
<70961>
<29694-3>
<18427-2>
<14240-3>
<15706-6>
<29670-3>
<27184-1>
<28014-0>
<13163-0>
<12573-0>
<16190-3>
<11394-5>
<12253-4>
<19740-0>
<12589-6>
<19167-4>
<29241-5>
<27455-3>
<26406-0>
<19432-4>
<10722-5>
<12588-1>
<12953-4>
<14599-0>
<10450-5>
<18606-2>
<19204-3>
<19585-0>
<12070-5>
<28494-2>
<14176-0>
<19683-0>
<19660-5>
<12371-5>
<28940-5>
<19522-3>
<12702-1>
<19821-0>
<13053-0>
<29962-4>
<24664-2>
<29661-4>
<18969-1>
<16166-0>
<13493-0>
<16050-5>
<12618-4>
<14814-1>
<20002-5>
<10784-4>
<71106>
<17609-1>
<13340-4>
<13428-4>
<180787>
<15475-6>
<20404-6>
<13377-2>
<14996-4>
<29840-4>
<12049-3>
<19584-2>
<15638-4>
<15883-5>
<19349-5>
<11487-5>
<13039-1>
<12535-1>
<16968-6>
<18285-3>
<18242-0>
<18884-2>
<19607-2>
<18076-5>
<18225-0>
<19046-2>
<13179-6>
<11560-0>
<27839-6>
<29683-1>
<18547-6>
<14003-3>
<15700-4>
<13692-1>
<16896-5>
<18144-0>
<10882-4>
<17946-4>
<11852-1>
<12192-5>
<12088-0>
<14989-1>
<19028-4>
<18923-4>
<11963-6>
<29820-3>
<13867-6>
<12543-2>
<26308-0>
<70899>
<19364-2>
<26626-0>
<15243-6>
<16250-4>
<19042-3>
<14461-1>
<15801-5>
<10040-3>
<29901-3>
<26310-6>
<16470-4>
<13185-4>
<18360-1>
<29777-6>
<18921-1>
<11527-5>
<18625-5>
<11209-5>
<19704-4>
<12361-1>
<17732-2>
<17806-6>
<17668-6>
<11215-3>
<13773-1>
<16266-3>
<18395-3>
<30108-4>
<70505>
<30051-0>
<11301-3>
<11859-1>
<10776-3>
<12308-5>
<20442-5>
<26378-0>
<13014-3>
<11873-0>
<13572-4>
<13776-2>
<19748-5>
<12962-3>
<29690-4>
<70465>
<30097-4>
<14268-2>
<12038-1>
<10276-2>
<70991>
<29894-2>
<18993-4>
<15635-3>
<12297-5>
<16410-1>
<70580>
<29676-5>
<14583-1>
<29897-3>
<14318-6>
<15644-2>
<14463-4>
<18259-4>
<30057-2>
<19106-3>
<11252-4>
<10094-1>
<19009-1>
<11822-3>
<16759-1>
<16379-4>
<70876>
<16290-6>
<12615-3>
<24707-3>
<10187-1>
<12844-2>
<19470-3>
<19171-6>
<29401-2>
<18887-3>
<18577-4>
<12039-6>
<29687-0>
<18940-4>
<10964-2>
<15947-5>
<14607-6>
<19611-4>
<17705-5>
<10978-5>
<19104-0>
<29654-1>
<15340-1>
<13383-0>
<19175-5>
<18310-2>
<13436-5>
<28482-2>
<10514-5>
<15761-5>
<27167-1>
<16975-2>
<16757-5>
<13391-1>
<29942-3>
<18954-0>
<11288-4>
<73391>
<11901-0>
<18636-0>
<26083-5>
<15267-6>
<28978-1>
<73337>
<72180>
<19404-2>
<18336-5>
<29644-4>
<14846-2>
<24784-6>
<12071-3>
<19293-6>
<30042-1>
<15599-2>
<70140>
<10555-5>
<15050-3>
<10489-6>
<29947-0>
<13828-2>
<12018-0>
<29786-5>
<16504-6>
<17171-2>
<17616-4>
<29965-5>
<12197-2>
<17682-5>
<15740-6>
<11237-0>
<14412-0>
<12081-0>
<14116-4>
<14741-2>
<20906-3>
<14941-1>
<26829-0>
<29585-1>
<12998-3>
<29857-1>
<13238-2>
<26756-1>
<11916-1>
<16760-2>
<16597-1>
<12880-5>
<15082-4>
<10092-5>
<14042-0>
<17684-1>
<13588-3>
<14350-3>
<19043-1>
<71095>
<14960-4>
<18656-1>
<70582>
<16654-1>
<19545-5>
<10923-2>
<10129-1>
<26249-4>
<18834-3>
<18017-0>
<14998-0>
<15927-4>
<12846-5>
<18238-5>
<13351-6>
<13145-2>
<30023-5>
<13384-5>
<19989-4>
<30086-2>
<12907-4>
<184936>
<10786-0>
<14972-4>
<18428-0>
<19102-4>
<14007-2>
<29997-6>
<10109-0>
<15036-4>
<19561-0>
<70169>
<18329-2>
<14829-2>
<19249-2>
<15746-1>
<19355-3>
<21110-4>
<12960-0>
<12205-1>
<11587-1>
<16805-6>
<19003-6>
<19241-4>
<10637-3>
<10020-2>
<29990-6>
<29924-5>
<26645-3>
<26500-1>
<18968-3>
<15005-1>
<13085-1>
<29028-5>
<18110-3>
<15910-0>
<29960-1>
<15786-3>
<11709-6>
<12201-2>
<13809-6>
<17780-5>
<18806-1>
<28923-5>
<18062-2>
<12022-2>
<13029-4>
<70999>
<16471-2>
<71117>
<18240-4>
<18617-4>
<70942>
<29851-6>
<19429-0>
<18123-1>
<11976-4>
<19263-1>
<29800-2>
<18349-3>
<12945-3>
<19620-3>
<13881-5>
<14310-1>
<26391-1>
<13148-3>
<20402-3>
<14049-0>
<12320-1>
<28701-2>
<10085-2>
<12562-5>
<12987-1>
<20018-4>
<15699-5>
<15952-5>
<19041-5>
<14125-3>
<15142-5>
<29982-5>
<71039>
<11327-6>
<18437-6>
<10261-1>
<73383>
<13412-5>
<12779-1>
<17721-0>
<19254-2>
<11362-4>
<10754-6>
<10768-2>
<12230-2>
<12172-4>
<19225-2>
<11447-3>
<13831-6>
<18116-5>
<16384-4>
<71029>
<11402-4>
<15627-2>
<19307-0>
<11578-2>
<30043-6>
<29973-6>
<10671-3>
<29665-3>
<16372-4>
<18870-6>
<13375-6>
<11657-6>
<17622-2>
<10652-0>
<10180-1>
<13678-2>
<11495-6>
<19371-5>
<26435-0>
<20948-1>
<29181-4>
<180788>
<18263-6>
<18868-0>
<11642-5>
<12524-6>
<10024-1>
<18919-2>
<19860-4>
<12563-3>
<19597-0>
<17014-4>
<13367-5>
<71087>
<18412-1>
<11629-4>
<19017-2>
<70278>
<16328-0>
<16830-0>
<19839-2>
<29601-1>
<26857-2>
<26192-0>
<11042-1>
<15974-2>
<14017-6>
<12370-0>
<10177-4>
<28977-3>
<18901-0>
<15080-1>
<19119-1>
<26498-4>
<15571-3>
<26856-4>
<14053-2>
<18099-0>
<19634-6>
<71070>
<29699-0>
<29991-4>
<11347-0>
<14751-6>
<19228-3>
<15518-0>
<11272-5>
<10816-3>
<16529-4>
<70307>
<13232-0>
<13747-2>
<12609-5>
<18575-1>
<19533-5>
<29828-1>
<71010>
<29751-3>
<29121-1>
<13861-4>
<12065-5>
<11707-3>
<13980-3>
<15102-3>
<29623-5>
<29554-5>
<10877-4>
<26479-1>
<19721-4>
<16081-1>
<16318-3>
<14640-1>
<17017-5>
<10343-6>
<11127-0>
<12259-6>
<19790-6>
<13514-4>
<20485-1>
<16670-3>
<18674-6>
<20277-1>
<28561-6>
<29881-4>
<29043-2>
<20897-6>
<11919-2>
<11398-4>
<12013-3>
<17472-2>
<13153-3>
<13949-4>
<15415-3>
<11159-1>
<71108>
<18334-2>
<18800-6>
<12716-4>
<16382-1>
<18274-1>
<12785-6>
<13617-1>
<11801-4>
<18068-4>
<11521-3>
<13136-3>
<29780-3>
<10413-4>
<30005-0>
<11983-0>
<14328-3>
<30010-0>
<25742-3>
<16515-1>
<12014-1>
<19499-0>
<18913-0>
<19341-0>
<194374>
<19553-6>
<29963-2>
<29552-2>
<15774-3>
<27282-1>
<29579-3>
<19296-0>
<10981-2>
<27615-0>
<18008-1>
<19361-1>
<19345-6>
<14983-6>
<30062-2>
<71103>
<18361-6>
<16283-3>
<27683-4>
<12761-6>
<73359>
<70843>
<11424-1>
<19013-3>
<12103-2>
<19539-0>
<12837-6>
<10037-6>
<15346-3>
<10344-4>
<11921-1>
<16445-3>
<15088-6>
<72183>
<13060-3>
<17502-5>
<19638-5>
<18095-1>
<13054-5>
<11971-0>
<71110>
<14766-0>
<14015-3>
<12610-6>
<10838-0>
<19196-4>
<15925-1>
<19020-6>
<29719-6>
<19795-3>
<12251-1>
<18312-5>
<16834-6>
<18018-5>
<19047-0>
<11879-2>
<14141-5>
<19422-0>
<18224-2>
<12458-0>
<17636-5>
<12670-2>
<13321-1>
<20176-0>
<18907-2>
<11356-6>
<11717-0>
<11285-3>
<12964-6>
<10699-2>
<12170-1>
<18962-1>
<13393-4>
<13221-5>
<18260-5>
<11189-6>
<29733-5>
<19183-6>
<18199-3>
<11281-4>
<19588-1>
<29720-0>
<19438-6>
<29282-5>
<19829-5>
<19654-0>
<11599-1>
<10593-4>
<14479-3>
<10205-4>
<19412-3>
<16308-6>
<14044-3>
<16306-3>
<15719-4>
<13832-4>
<15775-1>
<29682-3>
<18304-4>
<26290-0>
<15899-4>
<71025>
<28601-6>
<13425-3>
<19363-4>
<19353-0>
<18990-3>
<29704-5>
<30089-3>
<15105-4>
<15365-6>
<17628-4>
<29631-6>
<10503-3>
<14462-6>
<12416-2>
<19088-0>
<26448-5>
<28405-6>
<13305-6>
<13025-5>
<16404-3>
<13259-1>
<10055-4>
<18405-5>
<19378-5>
<12036-5>
<13600-4>
<70209>
<30044-4>
<15520-6>
<19614-5>
<16824-2>
<19008-3>
<18175-3>
<13720-1>
<15970-3>
<20401-5>
<12281-6>
<10521-1>
<14924-1>
<15703-5>
<16723-1>
<20881-0>
<29875-6>
<15646-5>
<15656-2>
<10252-2>
<26808-1>
<10148-4>
<19812-1>
<13406-0>
<196912>
<10015-2>
<26709-3>
<19440-5>
<11187-3>
<10572-5>
<10432-0>
<13006-2>
<11556-5>
<15330-4>
<19671-0>
<19966-2>
<12812-1>
<15770-4>
<29592-4>
<12330-5>
<10339-4>
<18027-4>
<14812-5>
<71068>
<18992-6>
<29902-1>
<15689-1>
<26340-4>
<16136-2>
<14702-5>
<14985-2>
<13645-3>
<30018-5>
<19547-1>
<29061-0>
<11929-6>
<16427-5>
<70058>
<17632-6>
<17920-1>
<70498>
<11668-1>
<10851-1>
<14070-2>
<19723-0>
<18909-5>
<12031-1>
<15940-5>
<13738-3>
<10052-3>
<70384>
<26380-6>
<29864-4>
<19493-5>
<28817-4>
<14300-4>
<19091-4>
<26900-6>
<17578-0>
<19382-0>
<16016-5>
<13354-0>
<b>
<29564-2>
<14938-4>
<15956-4>
<19677-2>
<27565-3>
<18850-5>
<12261-5>
<29730-4>
<12510-3>
<13427-6>
<14109-1>
<13357-1>
<19155-4>
<18307-5>
<19163-5>
<18443-4>
<13543-4>
<11328-4>
<13736-0>
<19587-3>
<17999-4>
<71093>
<12401-1>
<18496-4>
<29791-5>
<194062>
<73301>
<15671-6>
<17586-1>
<16842-0>
<13141-3>
<18007-3>
<16454-2>
<15611-3>
<13307-2>
<11979-5>
<19107-1>
<12625-0>
<15983-1>
<16185-3>
<10140-6>
<17923-2>
<14004-1>
<19785-6>
<18994-2>
<12712-5>
<26736-0>
<73339>
<13829-0>
<11349-3>
<15677-1>
<18960-5>
<12263-1>
<27743-5>
<11540-6>
<13426-1>
<11704-2>
<11641-0>
<18138-2>
<10377-3>
<70883>
<29801-0>
<11406-3>
<13545-0>
<10087-5>
<18559-6>
<19492-0>
<14480-4>
<70091>
<26603-5>
<10248-0>
<19681-4>
<29775-3>
<13995-4>
<15937-1>
<17638-1>
<29596-3>
<29848-2>
<29698-2>
<11931-5>
<15468-3>
<18449-6>
<19720-6>
<26409-1>
<70556>
<19776-0>
<10603-6>
<29030-4>
<10211-2>
<19516-5>
<18879-2>
<10833-3>
<29639-4>
<19139-2>
<29937-3>
<13024-0>
<29681-5>
<10522-6>
<26247-1>
<12078-3>
<16311-3>
<19464-5>
<16012-6>
<16680-0>
<13561-2>
<12981-6>
<14408-5>
<27426-3>
<16001-4>
<13957-5>
<12807-1>
<10028-0>
<13643-0>
<11888-1>
<18837-4>
<29946-2>
<12957-3>
<30073-4>
<17672-1>
<16599-4>
<11611-2>
<13331-5>
<16562-6>
<11553-4>
<11375-2>
<13615-5>
<19609-5>
<12224-4>
<20409-3>
<26130-1>
<10676-0>
<11819-6>
<29760-2>
<19837-6>
<14169-4>
<11769-2>
<30006-5>
<13177-3>
<14068-3>
<71053>
<15662-0>
<13536-1>
<13970-6>
<12492-0>
<26622-1>
<15914-6>
<13149-1>
<13176-5>
<14216-0>
<29956-6>
<29461-5>
<12533-5>
<19542-4>
<13460-1>
<18316-4>
<17753-1>
<26641-4>
<26787-4>
<14223-3>
<16192-6>
<26537-6>
<10850-3>
<10421-5>
<70386>
<18871-4>
<10758-5>
<18396-1>
<29651-0>
<16198-1>
<11543-0>
<18234-6>
<10770-1>
<18433-0>
<12649-0>
<70416>
<19019-5>
<13157-2>
<70822>
<10976-2>
<15472-5>
<16729-3>
<13256-0>
<16245-4>
<19424-3>
<71115>
<16324-1>
<10286-6>
<29829-6>
<11914-5>
<73331>
<13735-2>
<19124-1>
<11469-0>
<12210-1>
<71020>
<20789-2>
<10678-3>
<19771-3>
<16159-4>
<19068-6>
<17967-3>
<10250-6>
<10552-4>
<14930-6>
<16401-2>
<15001-2>
<16676-5>
<12800-1>
<11686-6>
<11269-1>
<10049-6>
<19415-4>
<71084>
<29926-1>
<13998-5>
<71002>
<12780-2>
<16229-2>
<18343-1>
<19146-5>
<18595-2>
<13591-0>
<73302>
<15658-5>
<13504-0>
<26879-6>
<19202-0>
<11054-1>
<17598-1>
<16422-1>
<13873-4>
<19210-1>
<18508-2>
<11345-4>
<10993-2>
<17962-6>
<10684-1>
<29841-2>
<11360-1>
<10692-2>
<30112-6>
<10512-2>
<16604-2>
<15891-6>
<18066-1>
<13034-4>
<13665-4>
<17696-1>
<29905-2>
<71081>
<11322-2>
<19005-2>
<14039-3>
<16973-6>
<19615-3>
<19199-5>
<17184-0>
<14145-4>
<13159-5>
<19113-6>
<15763-1>
<15661-2>
<70383>
<24855-2>
<29595-5>
<11972-5>
<17731-4>
<15515-6>
<17782-1>
<14525-1>
<15797-5>
<16252-0>
<11574-3>
<19116-0>
<19457-2>
<10858-1>
<19598-5>
<11728-2>
<14225-6>
<13339-3>
<19566-4>
<18192-3>
<29833-1>
<16964-0>
<29779-2>
<19475-0>
<73353>
<13824-3>
<29063-3>
<29225-3>
<18785-4>
<11866-4>
<29951-2>
<18818-1>
<11033-2>
<19180-5>
<14205-5>
<21072-0>
<10985-1>
<13160-6>
<12949-2>
<11358-2>
<18958-6>
<29680-0>
<16325-6>
<10051-5>
<19916-3>
<19448-3>
<11070-3>
<12905-1>
<13244-0>
<70178>
<17602-1>
<26643-0>
<10190-5>
<18032-4>
<18121-5>
<20468-1>
<13777-0>
<29824-2>
<12376-2>
<19316-6>
<12166-6>
<16430-2>
<12896-4>
<13533-0>
<19039-6>
<16340-3>
<18594-4>
<14153-5>
<16176-4>
<17662-4>
<18840-1>
<28488-4>
<29812-2>
<17964-2>
<12932-5>
<18367-1>
<26842-1>
<19283-2>
<13785-1>
<13509-4>
<30099-0>
<17942-5>
<19449-1>
<19675-6>
<14313-2>
<26151-0>
<17652-0>
<18928-1>
<29576-2>
<18781-5>
<17941-0>
<21283-1>
<19778-3>
<16510-4>
<30050-2>
<14037-0>
<73341>
<12741-5>
<13529-5>
<13518-3>
<11648-0>
<29748-6>
<18922-6>
<10192-1>
<10804-3>
<10340-5>
<16628-2>
<27795-0>
<11485-2>
<70030>
<26538-4>
<18001-1>
<10113-2>
<26175-0>
<70888>
<17993-2>
<70929>
<29614-6>
<29557-6>
<27601-4>
<20381-6>
<15493-4>
<12225-2>
<13652-6>
<19317-4>
<15647-3>
<13283-4>
<12651-6>
<19835-3>
<12912-4>
<19240-6>
<14549-1>
<73334>
<73377>
<11370-5>
<13818-5>
<19394-0>
<18392-2>
<70968>
<12927-5>
<root>
<15949-1>
<30022-0>
<13368-3>
<16269-4>
<16203-6>
<26410-2>
<21020-5>
<18014-6>
<11449-6>
<18878-4>
<28859-2>
<11367-1>
<15998-2>
<10060-4>
<13281-1>
<10690-6>
<29735-1>
<19154-6>
<14420-1>
<10487-3>
<13218-1>
<13480-2>
<14046-6>
<13527-2>
<18353-5>
<26191-2>
<10753-1>
<14299-5>
<11260-5>
<14055-5>
<13004-6>
<11675-4>
<18362-4>
<14163-2>
<16286-4>
<19108-6>
<28187-4>
<14170-5>
<11778-1>
<24706-5>
<18359-0>
<18832-0>
<12928-3>
<10169-3>
<13197-4>
<29794-6>
<12939-5>
<12571-4>
<15929-0>
<19191-0>
<29949-3>
<19595-4>
<12285-5>
<11441-1>
<15163-4>
<30075-0>
<19975-1>
<26445-4>
<17675-2>
<14130-3>
<11906-4>
<182604>
<16249-3>
<19773-6>
<29671-1>
<14011-4>
<19227-5>
<26133-2>
<17677-5>
<14154-3>
<16312-1>
<12590-0>
<71051>
<71060>
<16953-5>
<70306>
<30067-6>
<70880>
<19575-3>
<179318>
<28794-4>
<18521-3>
<18290-3>
<10812-4>
<13386-1>
<195096>
<10568-3>
<15519-5>
<10178-2>
<70847>
<11421-0>
<11219-2>
<26164-5>
<12805-5>
<16326-4>
<29853-2>
<13890-4>
<28848-0>
<19687-6>
<10653-5>
<12675-6>
<10948-0>
<14175-2>
<14025-0>
<29769-5>
<73305>
<17791-0>
<29586-6>
<13325-0>
<12786-4>
<27963-5>
<12198-0>
<13418-0>
<15637-6>
<18746-0>
<14143-1>
<26287-3>
<10171-2>
<19312-0>
<20301-2>
<30104-5>
<71073>
<13437-3>
<15220-4>
<13399-6>
<14341-4>
<70026>
<14407-0>
<19674-1>
<19630-0>
<12056-6>
<19751-2>
<12357-6>
<14294-1>
<70825>
<16330-6>
<29753-6>
<19414-6>
<12212-4>
<12946-1>
<16512-0>
<29934-2>
<14302-0>
<19847-3>
<16950-4>
<18679-3>
<12594-6>
<11357-4>
<10058-5>
<71109>
<16788-1>
<29931-1>
<12089-5>
<30025-1>
<19384-3>
<19173-2>
<19132-2>
<10566-0>
<19758-2>
<13365-2>
<11182-6>
<18708-1>
<10706-3>
<11734-0>
<18660-3>
<17712-1>
<18182-6>
<17553-2>
<18455-4>
<19682-2>
<15444-3>
<10010-5>
<10326-6>
<19564-1>
<13082-0>
<19024-5>
<11366-3>
<16963-2>
<14539-4>
<13573-2>
<18352-0>
<19803-2>
<29917-2>
<13662-3>
<17989-0>
<15900-3>
<18305-2>
<14931-4>
<11348-5>
<29565-0>
<29749-4>
<10957-6>
<10806-6>
<18333-4>
<11212-2>
<26556-2>
<15919-3>
<13580-5>
<10505-6>
<11222-6>
<19129-5>
<19335-2>
<19391-6>
<12153-1>
<13966-4>
<73376>
<19460-6>
<16792-3>
<70144>
<18736-3>
<15669-0>
<10110-1>
<14098-1>
<11576-6>
<13151-0>
<11282-2>
<27784-5>
<18932-3>
<24666-5>
<16522-4>
<10880-1>
<18002-6>
<26332-3>
<18135-1>
<16309-4>
<11203-3>
<12023-0>
<19703-6>
<10112-4>
<12075-2>
<15922-0>
<14012-2>
<14164-0>
<12246-1>
<28076-6>
<19115-2>
<11240-4>
<13935-1>
<18031-6>
<70128>
<19012-5>
<16540-2>
<10310-0>
<18441-1>
<13686-3>
<26082-0>
<15733-3>
<10114-0>
<17688-0>
<11909-5>
<29736-6>
<26788-2>
<18633-6>
<19380-4>
<10533-1>
<11905-6>
<14160-1>
<13688-6>
<13569-0>
<10811-6>
<17179-0>
<73300>
<13284-2>
<10494-6>
<13343-5>
<15543-1>
<15954-1>
<14285-2>
<16011-1>
<29571-5>
<18171-4>
<19140-3>
<29555-3>
<14397-5>
<29773-0>
<70301>
<10056-2>
<10349-1>
<10139-5>
<30035-5>
<193280>
<17642-3>
<70893>
<15941-3>
<10682-5>
<20855-1>
<17687-2>
<13454-3>
<70012>
<28952-5>
<16545-6>
<16658-0>
<19659-4>
<17658-2>
<10036-1>
<28342-4>
<70903>
<18607-0>
<16435-6>
<12129-5>
<15737-2>
<10411-1>
<15659-3>
<18000-3>
<70373>
<18957-1>
<10644-6>
<15619-1>
<16122-6>
<10897-5>
<29447-6>
<30052-5>
<18560-0>
<16486-3>
<10415-0>
<29713-4>
<30083-1>
<73347>
<26392-6>
<17770-1>
<13450-4>
<29546-4>
<12920-5>
<26446-2>
<16786-5>
<14456-1>
<10223-2>
<18668-1>
<19336-0>
<11893-1>
<16556-1>
<19002-1>
<17608-3>
<19692-6>
<14752-4>
<15469-1>
<20261-2>
<10635-0>
<28445-1>
<26804-2>
<11973-3>
<11571-2>
<16957-4>
<11844-0>
<11770-3>
<18500-4>
<12925-2>
<12441-3>
<16958-2>
<19524-6>
<10898-3>
<15038-0>
<14975-5>
<12825-6>
<16984-1>
<29907-5>
<29442-2>
<11544-5>
<16032-0>
<70101>
<19045-4>
<70415>
<19339-1>
<13724-0>
<10734-5>
<18953-2>
<29861-3>
<19037-3>
<29929-2>
<20125-3>
<71026>
<29029-3>
<13820-4>
<18414-4>
<14948-1>
<29243-1>
<16949-3>
<16982-5>
<28710-1>
<10034-5>
<11216-1>
<13622-1>
<29948-5>
<13679-0>
<29637-1>
<26394-2>
<26734-4>
<18501-2>
<19741-5>
<14371-2>
<73396>
<17749-6>
<14973-2>
<70014>
<16548-0>
<19854-6>
<28840-2>
<11355-1>
<19833-0>
<18376-0>
<12232-5>
<12265-4>
<19537-4>
<18539-5>
<19551-3>
<10080-5>
<15535-0>
<70963>
<16641-3>
<16739-0>
<19581-1>
<17654-3>
<18364-0>
<12026-1>
<14466-5>
<29677-3>
<14129-2>
<13156-4>
<19761-6>
<29795-4>
<16007-6>
<12931-0>
<29361-2>
<10517-6>
<17680-2>
<18792-0>
<71016>
<18212-2>
<13987-3>
<14182-5>
<10144-5>
<12982-4>
<29989-5>
<12239-5>
<12272-0>
<14793-4>
<13745-6>
<16485-5>
<10073-2>
<19474-2>
<19536-6>
<70423>
<13001-5>
<26580-5>
<14258-5>
<15350-5>
<10068-2>
<18366-3>
<18436-1>
<11956-3>
<19765-5>
<11771-1>
<12971-2>
<18613-5>
<12004-4>
<15672-4>
<18700-3>
<11818-1>
<13578-6>
<29954-3>
<18862-5>
<19067-1>
<71007>
<29871-0>
<11067-6>
<11142-4>
<18233-1>
<13090-1>
<19406-5>
<17829-1>
<73362>
<29898-1>
<18093-5>
<11562-3>
<70199>
<24665-0>
<16566-5>
<12612-2>
<16029-3>
<13395-0>
<17739-2>
<17783-6>
<11673-1>
<10097-2>
<16361-2>
<71035>
<18003-4>
<10346-0>
<10164-6>
<19713-3>
<18983-0>
<18955-5>
<15266-1>
<18917-6>
<10464-1>
<29066-4>
<18061-4>
<11039-4>
<16409-0>
<10618-0>
<16828-1>
<71017>
<15881-2>
<19737-3>
<10558-6>
<13293-1>
<71100>
<17503-3>
<26161-4>
<18064-5>
<29903-6>
<12677-2>
<12287-1>
<16650-2>
<29743-2>
<71024>
<18738-6>
<19301-5>
<15115-1>
<15392-3>
<19586-5>
<29763-3>
<13209-2>
<17461-0>
<11552-6>
<12438-6>
<18783-1>
<13285-0>
<17801-2>
<26224-6>
<18920-3>
<26707-0>
<10610-2>
<70459>
<17624-5>
<12142-6>
<15994-3>
<11210-6>
<18077-3>
<18965-2>
<13152-5>
<70346>
<18888-1>
<13608-2>
<20762-1>
<18716-2>
<11415-2>
<19734-2>
<28439-3>
<18221-1>
<16031-2>
<15743-0>
<11201-0>
<70865>
<15823-2>
<29102-5>
<13965-6>
<27813-3>
<29645-2>
<16638-6>
<19218-6>
<70368>
<18986-1>
<17695-3>
<12918-6>
<19201-2>
<70234>
<70233>
<19321-6>
<10412-6>
<12969-3>
<18881-1>
<19510-3>
<19767-1>
<13655-0>
<14056-3>
<29324-1>
<10298-6>
<29813-0>
<12280-1>
<11158-3>
<11261-3>
<70029>
<19685-3>
<29873-3>
<16212-5>
<14218-3>
<10829-1>
<13593-3>
<14181-0>
<16017-3>
<18078-1>
<13443-1>
<11430-6>
<20506-5>
<18780-0>
<29001-4>
<16186-1>
<11284-5>
<14593-5>
<14090-3>
<18743-6>
<16364-3>
<71033>
<18696-3>
<16355-4>
<29724-6>
<17497-0>
<15705-1>
<70292>
<20982-1>
<29870-2>
<17713-6>
<18063-0>
<16100-2>
<11164-1>
<11821-5>
<18012-3>
<29729-3>
<19198-0>
<29899-6>
<16003-0>
<18399-2>
<181994>
<17984-3>
<18744-4>
<11826-2>
<15606-3>
<29574-6>
<19141-1>
<18287-6>
<19084-1>
<12399-4>
<13756-1>
<30103-0>
<11452-3>
<12775-2>
<11163-3>
<14971-6>
<15690-2>
<18085-4>
<30040-5>
<10642-3>
<10504-1>
<16962-4>
<29583-5>
<16146-6>
<70242>
<10282-0>
<29879-5>
<18532-5>
<15135-2>
<28384-2>
<17740-3>
<71008>
<29935-0>
<17778-6>
<15872-3>
<11063-0>
<19188-3>
<26522-5>
<19302-3>
<18531-0>
<10963-4>
<29444-5>
<70418>
<26102-6>
<26022-4>
<14600-6>
<19352-2>
<14093-4>
<19570-6>
<15466-0>
<13670-4>
<13274-5>
<11917-6>
<17709-4>
<29811-4>
<19025-3>
<11318-0>
<13979-2>
<16704-5>
<16041-6>
<19567-2>
<19187-5>
<13381-4>
<10304-2>
<30101-4>
<18308-3>
<18590-5>
<18564-6>
<197518>
<71071>
<11510-1>
<18588-6>
<19222-1>
<26149-1>
<20987-5>
<12754-3>
<16288-0>
<10077-1>
<10901-5>
<13706-2>
<12570-6>
<11496-4>
<27816-4>
<18137-4>
<27762-1>
<14047-4>
<11579-0>
<19285-5>
<18169-5>
<29740-1>
<18795-1>
<19314-3>
<13252-1>
<19661-3>
<13793-2>
<10065-1>
<11068-4>
<16995-3>
<16525-5>
<11286-1>
<11419-1>
<24786-2>
<11407-1>
<10805-1>
<70011>
<18572-0>
<12567-2>
<18904-1>
<70038>
<19362-6>
<16909-1>
<70003>
<19038-1>
<12845-0>
<29958-2>
<30041-3>
<18345-4>
<19476-5>
<10324-3>
<70860>
<18330-3>
<11820-0>
<17569-1>
<12435-5>
<70904>
<71078>
<10836-4>
<11401-6>
<71076>
<12278-2>
<16170-2>
<16479-0>
<13673-5>
<15888-2>
<14502-6>
<16621-2>
<18972-5>
<29693-5>
<10093-3>
<19830-6>
<29082-6>
<29573-1>
<16579-3>
<70902>
<70269>
<28023-6>
<10030-6>
<16642-1>
<17931-3>
<70493>
<18338-1>
<12394-0>
<14749-0>
<11658-4>
<12947-6>
<13127-4>
<18082-3>
<18325-3>
<10106-6>
<19768-6>
<30049-1>
<18386-4>
<12950-3>
<10142-2>
<26477-5>
<29790-0>
<24788-5>
<16692-0>
<70174>
<13689-4>
<18119-6>
<16635-5>
<18895-4>
<30038-6>
<15779-0>
<14534-0>
<13120-4>
<29674-2>
<14177-5>
<26521-0>
<10843-0>
<11057-2>
<26644-5>
<16726-2>
<71091>
<11810-3>
<17735-3>
<10823-6>
<29757-5>
<183025>
<29745-5>
<21094-4>
<19657-1>
<19670-2>
<13699-1>
<11573-5>
<30078-1>
<17717-5>
<14981-3>
<19941-4>
<25974-3>
<15976-5>
<19136-1>
<70647>
<10942-5>
<16712-6>
<14771-0>
<19247-6>
<13445-4>
<19259-6>
<14596-6>
<12766-3>
<30087-0>
<10629-2>
<15931-6>
<18381-0>
<13246-3>
<70958>
<21042-2>
<28418-4>
<14743-5>
<29742-4>
<12591-5>
<11876-1>
<19078-3>
<13255-2>
<17911-2>
<29221-4>
<180786>
<18603-1>
<13871-1>
<180785>
<12976-6>
<70936>
<10661-6>
<19215-5>
<11371-3>
<19221-3>
<16400-4>
<14885-6>
<16182-2>
<70361>
<10738-4>
<70992>
<11342-3>
<10996-3>
<17565-2>
<26393-4>
<14635-1>
<18486-0>
<15760-0>
<70403>
<10912-0>
<30009-6>
<19030-3>
<73381>
<12759-0>
<12306-2>
<17793-3>
<18609-3>
<29788-1>
<28030-2>
<26773-1>
<13560-4>
<11473-2>
<71062>
<12529-3>
<29052-1>
<10801-2>
<13410-2>
<72393>
<16495-2>
<19161-2>
<28921-2>
<70987>
<71015>
<17580-6>
<15759-6>
<11638-3>
<13564-3>
<10687-2>
<17738-4>
<15762-3>
<26132-4>
<15086-3>
<14926-4>
<10181-6>
<18402-4>
<71058>
<18989-2>
<18585-5>
<11787-0>
<15668-2>
<13722-4>
<18980-6>
<10196-0>
<14976-3>
<11716-2>
<12725-3>
<12575-3>
<10268-1>
<15477-2>
<15666-6>
<11832-0>
<70183>
<18172-2>
<10590-3>
<10239-1>
<10458-3>
<27721-1>
<10608-3>
<20553-3>
<29792-3>
<11912-2>
<v>
<13658-1>
<11047-5>
<12181-3>
<12720-6>
<20136-5>
<71005>
<70445>
<70832>
<30030-1>
<25681-4>
<11417-5>
<19708-3>
<10291-6>
<14073-3>
<19762-4>
<12298-3>
<29236-5>
<20967-4>
<10222-4>
<10930-5>
<18218-4>
<19197-2>
<14040-4>
<19389-0>
<28410-6>
<19856-2>
<11346-2>
<20455-3>
<12884-4>
<16134-6>
<16656-4>
<11680-4>
<16437-2>
<13969-5>
<19158-5>
<29807-2>
<13076-2>
<12996-0>
<12313-5>
<14946-5>
<29202-1>
<16303-2>
<12228-3>
<18612-0>
<14105-2>
<14197-6>
<13767-3>
<19433-2>
<17639-6>
<29944-6>
<29766-4>
<19407-3>
<15621-0>
<21306-1>
<70082>
<29648-3>
<18373-6>
<29547-2>
<18896-2>
<14802-1>
<15945-2>
<10872-0>
<13507-1>
<19622-6>
<11087-0>
<18689-0>
<15965-3>
<18754-1>
<13419-5>
<18127-0>
<14158-2>
<28329-3>
<15716-3>
<19487-0>
<15450-1>
<13011-2>
<17584-5>
<70192>
<29880-6>
<18377-5>
<18829-3>
<26068-1>
<11224-2>
<16979-1>
<13193-5>
<19802-4>
<10736-1>
<29568-1>
<16552-2>
<13277-6>
<18398-4>
<17568-3>
<19279-0>
<10057-0>
<70348>
<16354-6>
<71082>
<14135-0>
<28683-6>
<27588-5>
<12487-0>
<16651-0>
<10752-3>
<19728-4>
<29726-2>
<70506>
<13422-2>
<13446-2>
<29761-0>
<29702-2>
<10774-0>
<20503-4>
<19205-1>
<29608-1>
<19699-6>
<g>
<12354-5>
<70944>
<10961-1>
<10013-6>
<71077>
<19343-3>
<14778-0>
<26190-4>
<15751-1>
<11969-1>
<19185-2>
<197050>
<11915-3>
<12952-6>
<12841-1>
<19679-5>
<27104-4>
<13983-4>
<18857-5>
<11862-5>
<194915>
<10011-3>
<10048-1>
<11454-6>
<12273-5>
<29617-0>
<10185-5>
<18721-2>
<29970-5>
<11752-5>
<13268-0>
<19649-0>
<73351>
<15901-1>
<15778-2>
<18374-4>
<19250-3>
<18498-0>
<19484-6>
<12703-6>
<17758-5>
<19698-1>
<11390-6>
<18228-1>
<14196-1>
<14309-0>
<11809-2>
<16131-5>
<26084-3>
<24624-0>
<29974-4>
<14735-4>
<11276-4>
<14548-3>
<11451-5>
<29650-2>
<11341-5>
<16315-2>
<15093-6>
<10733-0>
<12168-2>
<12475-0>
<14955-4>
<26227-0>
<11676-2>
<13571-6>
<12975-1>
<12986-3>
<29839-3>
<29803-3>
<19299-1>
<18527-5>
<70406>
<16042-4>
<19253-4>
<30081-5>
<16405-1>
<10176-6>
<73390>
<10278-5>
<15939-4>
<10434-3>
<13704-6>
<14969-0>
<29632-4>
<18924-2>
<13064-2>
<16432-5>
<18988-4>
<26882-3>
<24623-2>
<13084-3>
<19143-4>
<13222-3>
<30027-4>
<14212-1>
<30084-6>
<70076>
<16247-0>
<19298-3>
<13837-1>
<11307-5>
<17590-3>
<70109>
<10198-3>
<16708-4>
<29980-2>
<12994-4>
<29303-2>
<10750-0>
<12207-4>
<14716-1>
<72184>
<180720>
<26841-3>
<19338-3>
<15328-5>
<18504-3>
<70187>
<12291-3>
<11951-6>
<18791-2>
<10237-5>
<19356-1>
<29229-2>
<10301-1>
<18645-6>
<18422-5>
<29988-0>
<29858-6>
<19843-4>
<19602-5>
<13989-6>
<14064-4>
<15011-6>
<29843-5>
<18380-2>
<11275-6>
<14737-0>
<12295-2>
<15373-0>
<29663-0>
<70889>
<26450-4>
<10219-0>
<70578>
<29666-1>
<12064-0>
<183027>
<14798-1>
<12531-2>
<194089>
<11558-1>
<29716-5>
<15961-4>
<70258>
<19286-3>
<29827-3>
<18219-2>
<15398-5>
<26361-3>
<12073-6>
<18838-2>
<18767-6>
<13207-6>
<12309-3>
<12029-2>
<14364-6>
<19329-4>
<16156-3>
<70037>
<196934>
<12194-1>
<18231-5>
<18544-5>
<29630-1>
<19826-4>
<26677-4>
<26558-5>
<19491-2>
<30034-0>
<10831-0>
<15836-0>
<19326-3>
<70259>
<19401-1>
<29237-3>
<14775-6>
<12196-4>
<13007-0>
<29544-1>
<19601-0>
<29664-5>
<11335-0>
<17176-6>
<18952-4>
<30095-1>
<19813-6>
<14490-1>
<197040>
<17771-6>
<27586-2>
<29012-6>
<70270>
<29329-5>
<11223-4>
<20241-1>
<29772-2>
<11161-0>
<18877-6>
<29712-6>
<18387-2>
<29822-6>
<16287-2>
<13621-3>
<29936-5>
<30060-6>
<28866-5>
<29627-4>
<71104>
<26623-6>
<13464-0>
<18894-6>
<12226-0>
<29659-5>
<17491-5>
<15742-2>
<18178-4>
<14200-1>
<12480-0>
<14446-4>
<11518-6>
<70879>
<11374-4>
<71086>
<15045-3>
<11659-2>
<15930-1>
<18278-0>
<13291-5>
<18944-3>
<19593-1>
<70900>
<16981-0>
<29230-3>
<12105-5>
<16661-4>
<18188-1>
<29618-5>
<28639-2>
<13287-3>
<11134-3>
<12697-3>
<14509-6>
<29581-2>
<11603-1>
<26806-5>
<15460-5>
<19730-3>
<29542-5>
<29957-4>
<10895-2>
<10962-6>
<11336-5>
<14146-2>
<10217-4>
<14121-4>
<26163-0>
<10201-5>
<17678-3>
<11729-0>
<13808-1>
<18214-5>
<13010-4>
<11564-6>
<15685-2>
<11907-2>
<29222-2>
<19600-2>
<29706-1>
<19111-3>
<17744-2>
<28954-1>
<19149-6>
<15880-4>
<16374-0>
<11968-3>
<29599-4>
<16207-5>
<15739-5>
<27675-3>
<10294-0>
<17987-4>
<15441-2>
<12760-1>
<13483-3>
<18615-1>
<26288-1>
<13345-1>
<19453-3>
<29972-1>
<19556-0>
<29933-4>
<16124-2>
<18880-3>
<12236-4>
<29718-1>
<70142>
<17013-6>
<29863-6>
<11321-4>
<73385>
<10730-6>
<70160>
<10513-0>
<19777-5>
<19318-2>
<16806-4>
<71094>
<18536-4>
<10436-6>
<13028-6>
<29635-5>
<29930-3>
<12387-4>
<71052>
<28089-4>
<70305>
<29647-5>
<19496-6>
<13217-3>
<26228-5>
<13610-1>
<28881-2>
<29976-0>
<19650-1>
<10845-3>
<11753-3>
<18943-5>
<15745-3>
<10667-1>
<15908-1>
<13269-5>
<11987-6>
<15723-6>
<28353-6>
<18393-0>
<13810-0>
<73365>
<16209-1>
<71112>
<29814-5>
<12292-1>
<29548-0>
<26381-4>
<19727-6>
<11694-0>
<18181-1>
<15097-5>
<29342-6>
<18599-1>
<16460-0>
<17679-1>
<17754-6>
<10194-4>
<16956-6>
<71044>
<29767-2>
<71105>
<16300-1>
<11503-5>
<16034-3>
<19658-6>
<70113>
<18314-1>
<18839-0>
<12883-6>
<16023-1>
<12047-0>
<14082-2>
<10022-5>
<15958-0>
<16713-4>
<10025-6>
<10815-5>
<12372-3>
<13074-6>
<29593-2>
<13363-6>
<17476-1>
<15754-2>
<18335-0>
<30015-4>
<20497-1>
<15938-6>
<12889-1>
<24787-0>
<16976-0>
<20921-0>
<12737-3>
<29823-4>
<70455>
<18186-5>
<20756-3>
<20744-3>
<11046-0>
<16436-4>
<11635-2>
<17781-3>
<13374-1>
<29837-0>
<19589-6>
<12916-3>
<18299-6>
<11494-1>
<16741-6>
<26359-4>
<18731-6>
<10272-3>
<11313-3>
<11448-1>
<10428-5>
<11088-5>
<13180-0>
<10673-6>
<19224-4>
<19160-4>
<16532-1>
<26407-5>
<16671-1>
<29588-2>
<10710-5>
<19684-5>
<16363-5>
<24704-2>
<30059-5>
<18680-4>
<19753-5>
<10950-6>
<14305-1>
<12904-3>
<19168-2>
<13601-2>
<30024-3>
<12910-1>
<12783-3>
<10541-2>
<18657-6>
<12613-0>
<19520-0>
<18241-2>
<14805-2>
<12381-2>
<30098-2>
<18930-0>
<29604-2>
<14435-2>
<13775-4>
<30076-5>
<n>
<13826-6>
<18611-2>
<73332>
<11533-3>
<14545-2>
<14306-6>
<18809-2>
<18815-0>
<18749-1>
<16724-6>
<14392-1>
<71056>
<19164-3>
<16971-3>
<13194-3>
<11038-6>
<70463>
<13161-4>
<13315-3>
<28046-1>
<20977-1>
<19608-0>
<19120-2>
<10072-4>
<12700-5>
<11754-1>
<18639-1>
<10928-6>
<18719-3>
<19811-3>
<16357-0>
<29445-3>
<13272-2>
<18419-1>
<14715-3>
<16774-5>
<13840-5>
<70504>
<14914-4>
<26225-4>
<10803-5>
<19623-4>
<13486-4>
<17689-5>
<29799-3>
<10597-3>
<11650-6>
<16202-1>
<11738-6>
<11788-5>
<19744-6>
<10285-1>
<14427-1>
<11199-3>
<11600-0>
<73373>
<12203-5>
<18087-0>
<11392-2>
<12718-0>
<16142-0>
<18286-1>
<18646-4>
<14087-6>
<17496-2>
<27144-6>
<14573-4>
<12806-3>
<10966-5>
<24783-1>
<17716-0>
<13641-4>
<18220-3>
<11784-6>
<12521-5>
<15315-0>
<18576-6>
<12254-2>
<19797-6>
<10814-0>
<18728-2>
<12605-6>
<19399-4>
<18023-5>
<10931-3>
<29636-3>
<10656-6>
<186753>
<19075-2>
<12913-2>
<70321>
<26807-3>
<30014-6>
<14292-5>
<18745-2>
<19958-1>
<12793-0>
<13577-1>
<13821-2>
<16961-6>
<11004-2>
<26432-6>
<11536-4>
<15907-3>
<19472-6>
<11352-0>
<29525-5>
<19310-4>
<13434-2>
<12470-3>
<12628-1>
<29783-4>
<18479-4>
<180783>
<19463-0>
<10909-3>
<26844-4>
<19934-1>
<15764-6>
<17949-5>
<14933-0>
<19324-0>
<10492-3>
<17915-1>
<18190-0>
<14646-3>
<15051-1>
<16674-2>
<15265-3>
<18550-3>
<12979-0>
<70834>
<71050>
<13055-3>
<18790-4>
<70845>
<17979-3>
<18574-3>
<12956-5>
<10418-1>
<17199-1>
<28820-1>
<13324-2>
<10102-0>
<29705-3>
<10019-1>
<10606-0>
<11618-2>
<10748-1>
<14189-5>
<28128-6>
<19350-6>
<29700-6>
<11246-6>
<18136-6>
<12565-6>
<18315-6>
<180988>
<11231-5>
<10508-0>
<11537-2>
<16952-0>
<19466-1>
<29182-2>
<19031-1>
<15446-6>
<71013>
<70147>
<29845-1>
<15251-0>
<10570-2>
<18379-1>
<19181-3>
<17596-5>
<10398-2>
<13576-3>
