{
    "settings": {
        "index": {
            "number_of_shards": 4,
            "number_of_replicas": 0
        },
        "analysis": {
            "normalizer": {
              "my_normalizer": {
                "type": "custom",
                "char_filter": [],
                "filter": ["lowercase", "asciifolding"]
              }
            }
          }
    },
    "mappings": {
        "document": {
            "date_detection": false,
            "properties": {
                "internalID": {
                    "type": "keyword",
                    "copy_to": false
                },
                "URL": {
                    "type": "keyword",
                    "copy_to": false
                },
                "title": {
                    "type": "text",
                    "analyzer": "default"
                },
                "description": {
                    "type": "text",
                    "copy_to": false
                },
                "language": {
                    "type": "keyword",
                    "copy_to": false,
                    "normalizer": "my_normalizer"
                },
                "contribute": {
                    "properties": {
                        "role": {
                            "properties": {
                                "source": {
                                    "type": "keyword",
                                    "copy_to": false
                                },
                                "value": {
                                    "type": "text",
                                    "copy_to": false
                                }
                            }
                        },
                        "entity": {
                            "properties": {
                                "ID": {
                                    "type": "keyword",
                                    "copy_to": false
                                },
                                "name": {
                                    "type": "text",
                                    "copy_to": false
                                }
                            }
                        }
                    }
                },
                "copyrightandotherrestrictions": {
                    "properties": {
                        "source": {
                            "type": "keyword",
                            "copy_to": false
                        },
                        "value": {
                            "type": "text",
                            "copy_to": false
                        },
                        "description": {
                            "type": "text",
                            "copy_to": false
                        }
                    }
                },
                "location": {
                    "type": "text",
                    "copy_to": false
                },
                "sourceRepository": {
                    "type": "keyword",
                    "copy_to": false
                },
                "datetime": {
                    "type": "date",
                    "format": "yyyy-MM-dd",
                    "copy_to": false
                },
                "catalogentry": {
                    "properties": {
                        "catalog": {
                            "type": "keyword",
                            "copy_to": false
                        },
                        "entry": {
                            "type": "text",
                            "copy_to": false
                        }
                    }
                },
                "keywords": {
                    "type": "text",
                    "copy_to": false
                },
                "metametadata": {
                    "properties": {
                        "identifier": {
                            "properties": {
                                "catalog": {
                                    "type": "keyword",
                                    "copy_to": false
                                },
                                "entry": {
                                    "type": "keyword",
                                    "copy_to": false
                                }
                            }
                        },
                        "contribute": {
                            "properties": {
                                "role": {
                                    "properties": {
                                        "source": {
                                            "type": "keyword",
                                            "copy_to": false
                                        },
                                        "value": {
                                            "type": "keyword",
                                            "copy_to": false
                                        }
                                    }
                                },
                                "entity": {
                                    "properties": {
                                        "ID": {
                                            "type": "keyword",
                                            "copy_to": false
                                        },
                                        "name": {
                                            "type": "text",
                                            "copy_to": false
                                        }
                                    }
                                }
                            }
                        }
                    }
                },
                "version": {
                    "type": "keyword",
                    "copy_to": false
                },
                "classification": {
                    "properties": {
                        "purpose": {
                            "properties": {
                                "source": {
                                    "type": "keyword",
                                    "copy_to": false
                                },
                                "value": {
                                    "type": "keyword",
                                    "copy_to": false
                                }
                            }
                        },
                        "taxonomyPath": {
                            "properties": {
                                "source": {
                                    "type": "keyword",
                                    "copy_to": false
                                },
                                "taxon": {
                                    "type": "keyword",
                                    "copy_to": false
                                },
                                "entry": {
                                    "type": "text",
                                    "copy_to": false
                                }
                            }
                        }
                    }
                },
                "learningresourcetype": {
                    "properties": {
                        "source": {
                            "type": "keyword",
                            "copy_to": false
                        },
                        "value": {
                            "type": "text",
                            "copy_to": false
                        }
                    }
                },
                "technical": {
                    "properties": {
                        "format": {
                            "type": "keyword",
                            "copy_to": false
                        },
                        "size": {
                            "type": "keyword",
                            "copy_to": false
                        },
                        "otherplatformrequirements": {
                            "type": "keyword",
                            "copy_to": false
                        }
                    }
                },
                "fulltext": {
                    "type": "text",
                    "analyzer": "default",
                    "copy_to": false
                },
                "abstract": {
                    "type": "text",
                    "analyzer": "default",
                    "copy_to": false
                }
            }
        }
    }
}