// Jest Snapshot v1, https://goo.gl/fbAQLP

exports[`Button snapshot test should Button render with no erros 1`] = `
<DocumentFragment>
  <button
    class="btn"
    style="background-color: white;"
    type="Button"
  >
    test text
  </button>
</DocumentFragment>
`;
