[
  {
    "name": "Lenovo V14",
    "price": "16 999",
    "url": "./assets/images/lenovo14.jpg",
    "code": 4654621,
    "color": "dark grey",
    "isFavorite": false
  },

  {
    "name": "ASUS TUF",
    "price": "43 999",
    "url": "./assets/images/asustuf.jpg",
    "code": 4654654,
    "color": "black",
    "isFavorite": false
  },

  {
    "name": "Acer Aspire 5 ",
    "price": "25 999",
    "url": "./assets/images/aceraspire5.jpg",
    "code": 87984,
    "color": "black",
    "isFavorite": false
  },

  {
    "name": "Apple MacBook Air 13",
    "price": "42 999",
    "url": "./assets/images/macbookair13.jpg",
    "code": 21354,
    "color": "white",
    "isFavorite": false
  },

  {
    "name": "HP Pavilion Gaming",
    "price": "45 999",
    "url": "./assets/images/hppavilion.jpg",
    "code": 4164,
    "color": "silver",
    "isFavorite": false
  },

  {
    "name": "Acer Aspire 7",
    "price": "39 999",
    "url": "./assets/images/aceraspire7.jpg",
    "code": 13464,
    "color": "black",
    "isFavorite": false
  },

  {
    "name": "Lenovo IdeaPad 3",
    "price": "13 999",
    "url": "./assets/images/lenovoideapad3.jpg",
    "code": 417446,
    "color": "grey",
    "isFavorite": false
  },

  {
    "name": "Acer Swift",
    "price": "17 999",
    "url": "./assets/images/acerswift.jpg",
    "code": 87541,
    "color": "white",
    "isFavorite": false
  },

  {
    "name": "Apple MacBook Pro 16",
    "price": "114 999",
    "url": "./assets/images/macbookpro16.jpg",
    "code": 48465,
    "color": "white",
    "isFavorite": false
  },

  {
    "name": "Lenovo V15-IGL",
    "price": "12 999",
    "url": "./assets/images/lenovov15.jpg",
    "code": 787451,
    "color": "silver",
    "isFavorite": false
  }
]
