[
  {
    "code" : "CHOCOLATE-BAR",
    "category" :  "FOOD",
    "imported" : false
  },
  {
    "code" : "CHOCOLATE-BOX-IMP",
    "category" :  "FOOD",
    "imported" : true
  },
  {
    "code" : "EN-BOOK-IMP",
    "category" :  "BOOK",
    "imported" : true
  },
  {
    "code" : "FRANGANCY-IMP",
    "category" :  "BEAUTY",
    "imported" : true
  },
  {
    "code" : "FR-BOOK",
    "category" :  "BOOK",
    "imported" : false
  },
  {
    "code" : "HEADACHE-PILLS-BOX",
    "category" :  "MEDICINE",
    "imported" : false
  },
  {
    "code" : "MUSICAL-CD",
    "category" :  "TUNES",
    "imported" : false
  },
  {
    "code" : "PARFUM",
    "category" :  "BEAUTY",
    "imported" : false
  }

]