{ 
    "_id" : ObjectId("5cdaa35c2ab79c0001bb739c"), "gender" : "Femme", "address" : "55 cite bougarfa", "deliveryAddress" : "ghazela", "firstname" : "chaima", "lastname" : "meliani", "phoneNumber" : "21175860", "birthDate" : "1994-10-12", "mail" : "chaima.meliani@gmail.com", "password" : "five12345", "isActive" : true, "orders" : [

    ]}
{ 
    "_id" : ObjectId("5cf4dd523cdea200018c2750"), 
    "address" : "addresse", 
    "firstname" : "dbibi", 
    "lastname" : "amine", 
    "phoneNumber" : "27963852", 
    "mail" : "adbibi@five-consulting.com", 
    "password" : "five12345", 
    "isActive" : false
    
}
{ 
    "_id" : ObjectId("5cf64c5dc5f22500011d68bf"), 
    "gender" : "Homme", 
    "address" : "adddress", 
    "reviews" : [

    ], 
    "firstname" : "test", 
    "lastname" : "test", 
    "phoneNumber" : "22369258", 
    "mail" : "client@gmail.com", 
    "password" : "five12345", 
    "isActive" : true, 
    "orders" : [

    ]
   
}
{ 
    "_id" : ObjectId("5cf6588ac5f22500011d68c0"), 
    "address" : "sdfdf sdfsdf", 
    "firstname" : "sdfdsf", 
    "lastname" : "sdfsdf", 
    "phoneNumber" : "21129590", 
    "mail" : "taiebhariz@gmail.com", 
    "password" : "azertyu123", 
    "isActive" : true
    
}
