{ 
    "_id" : ObjectId("5cd9107236d1a0000127fb82"), 
    "companyName" : "societe", 
    "address" : "adresse ", 
    "firstname" : "foulen", 
    "lastname" : "ben foulen", 
    "phoneNumber" : "98589634", 
    "birthDate" : "1980-01-20", 
    "mail" : "test@gmail.com", 
    "password" : "five12345", 
    "isActive" : true, 
    "_class" : "com.user.app.entites.Seller"
}
{ 
    "_id" : ObjectId("5cd9117636d1a0000127fb83"), 
    "companyName" : "test2", 
    "address" : "test2", 
    "firstname" : "test2", 
    "lastname" : "test2", 
    "phoneNumber" : "12345679", 
    "birthDate" : "1975-05-12", 
    "mail" : "test2@gmail.com", 
    "password" : "123456", 
    "isActive" : true, 
    "_class" : "com.user.app.entites.Seller"
}
{ 
    "_id" : ObjectId("5cebd68424aa9a00012a6bfa"), 
    "firstname" : "testt", 
    "lastname" : "testt", 
    "phoneNumber" : "21369258", 
    "mail" : "testt@mail.com", 
    "password" : "five12345", 
    "isActive" : false, 
    "_class" : "com.user.app.entites.Seller"
}
{ 
    "_id" : ObjectId("5cf64b97c5f22500011d68be"), 
    "firstname" : "seller", 
    "lastname" : "seller", 
    "phoneNumber" : "23698555", 
    "mail" : "seller@gmail.com", 
    "password" : "five12345", 
    "isActive" : false, 
    "_class" : "com.user.app.entites.Seller"
}
