{ 
    "_id" : ObjectId("5cc718993cdea2000141e941"), 
    "name" : "image1", 
    "path" : "https://s3.eu-west-3.amazonaws.com/marketplaceupload/1556791423054-samsung-galaxy-a7-1.jpg", 
    "product" : "5c9e80f8adbe1d0001779633", 
    "_class" : "com.product.app.entities.Image"
}
{ 
    "_id" : ObjectId("5cc86139c132d72a98d64d39"), 
    "name" : "image2", 
    "path" : "https://s3.eu-west-3.amazonaws.com/marketplaceupload/1556791517210-samsung-galaxy-A7-big.jpg", 
    "product" : "5c9e80f8adbe1d0001779633", 
    "_class" : "com.product.app.entities.Image"
}
{ 
    "_id" : ObjectId("5cc8616bc132d72a98d64d3a"), 
    "name" : "image3", 
    "path" : "https://s3.eu-west-3.amazonaws.com/marketplaceupload/1556791735010-636x900-samsungs9.jpg", 
    "product" : "5ca5c6afadbe1d00014ac3b1", 
    "_class" : "com.product.app.entities.Image"
}
{ 
    "_id" : ObjectId("5cc8617ec132d72a98d64d3b"), 
    "name" : "image4", 
    "path" : "https://s3.eu-west-3.amazonaws.com/marketplaceupload/1556791768060-samsung-galaxy-s9-1_800x430.jpg", 
    "product" : "5ca5c6afadbe1d00014ac3b1", 
    "_class" : "com.product.app.entities.Image"
}
{ 
    "_id" : ObjectId("5cc862e8c132d72a98d64d3d"), 
    "name" : "image6", 
    "path" : "https://s3.eu-west-3.amazonaws.com/marketplaceupload/1556791704837-91H1gIl8iCL._SX355_.jpg", 
    "product" : "5caf4d69adbe1d00019908d8", 
    "_class" : "com.product.app.entities.Image"
}
{ 
    "_id" : ObjectId("5ccafaf74d3ea318b0fc0ee7"), 
    "name" : "image7", 
    "path" : "https://s3.eu-west-3.amazonaws.com/marketplaceupload/1556809928821-1.jpg", 
    "product" : "5ccb083d48f8a6000174cca2", 
    "_class" : "com.product.app.entities.Image"
}
{ 
    "_id" : ObjectId("5ccafc2c4d3ea318b0fc0ee8"), 
    "name" : "image8", 
    "path" : "https://s3.eu-west-3.amazonaws.com/marketplaceupload/1556810279312-zen-lit-scandinave-tissu-gris-fonce-sommier-et-t.jpg", 
    "product" : "5ca239f7adbe1d0001850fe7", 
    "_class" : "com.product.app.entities.Image"
}
{ 
    "_id" : ObjectId("5d19c62942eba4000100da05"), 
    "name" : "Picture1.png", 
    "path" : "http://s3.eu-west-3.amazonaws.com/marketplaceupload/1561970212646-Picture1.png", 
    "product" : "5d19c62942eba4000100da04", 
    "_class" : "com.product.app.entities.Image"
}
