{
  "images" : [
    {
      "filename" : "icons8-verification-tick-mark-for-digital-certification-document-24.png",
      "idiom" : "universal",
      "language-direction" : "right-to-left",
      "scale" : "1x"
    },
    {
      "filename" : "icons8-verification-tick-mark-for-digital-certification-document-48.png",
      "idiom" : "universal",
      "language-direction" : "right-to-left",
      "scale" : "2x"
    },
    {
      "filename" : "icons8-verification-tick-mark-for-digital-certification-document-96.png",
      "idiom" : "universal",
      "language-direction" : "right-to-left",
      "scale" : "3x"
    }
  ],
  "info" : {
    "author" : "xcode",
    "version" : 1
  }
}
