{
  "images" : [
    {
      "filename" : "timer_ic.png",
      "idiom" : "universal",
      "language-direction" : "left-to-right",
      "scale" : "1x"
    },
    {
      "filename" : "timer_ic@2x.png",
      "idiom" : "universal",
      "language-direction" : "left-to-right",
      "scale" : "2x"
    },
    {
      "filename" : "timer_ic@3x.png",
      "idiom" : "universal",
      "language-direction" : "left-to-right",
      "scale" : "3x"
    }
  ],
  "info" : {
    "author" : "xcode",
    "version" : 1
  }
}
