{
    "swagger": "2.0",
    "info": {
        "description": "CMS Eventori API V1",
        "title": "CMS Eventori API",
        "contact": {},
        "version": "1.0"
    },
    "paths": {
        "/api/v1/merchent/create": {
            "post": {
                "description": "Create merchent",
                "consumes": [
                    "multipart/form-data"
                ],
                "produces": [
                    "text/plain"
                ],
                "tags": [
                    "Merchents"
                ],
                "summary": "Create merchent",
                "operationId": "merchents-merchent-create",
                "parameters": [
                    {
                        "type": "string",
                        "description": "Name",
                        "name": "name",
                        "in": "formData",
                        "required": true
                    },
                    {
                        "type": "string",
                        "description": "Alamat",
                        "name": "alamat",
                        "in": "formData",
                        "required": true
                    },
                    {
                        "enum": [
                            "gold",
                            "silver",
                            "platinum",
                            "bronze"
                        ],
                        "type": "string",
                        "description": "Jenis Merchent",
                        "name": "jenis",
                        "in": "formData",
                        "required": true
                    }
                ],
                "responses": {
                    "200": {
                        "description": "OK",
                        "schema": {
                            "$ref": "#/definitions/models.Merchent"
                        }
                    }
                }
            }
        },
        "/api/v1/merchent/delete/{id}": {
            "delete": {
                "description": "Delete merchent",
                "consumes": [
                    "multipart/form-data"
                ],
                "produces": [
                    "text/plain"
                ],
                "tags": [
                    "Merchents"
                ],
                "summary": "Delete merchent",
                "operationId": "merchents-merchent-delete",
                "parameters": [
                    {
                        "type": "integer",
                        "description": "ID",
                        "name": "id",
                        "in": "path",
                        "required": true
                    }
                ],
                "responses": {
                    "200": {
                        "description": "OK",
                        "schema": {
                            "$ref": "#/definitions/models.Merchent"
                        }
                    }
                }
            }
        },
        "/api/v1/merchent/detail/{id}": {
            "get": {
                "description": "Detail merchent",
                "consumes": [
                    "multipart/form-data"
                ],
                "produces": [
                    "text/plain"
                ],
                "tags": [
                    "Merchents"
                ],
                "summary": "Detail merchent",
                "operationId": "merchents-merchent-detail",
                "parameters": [
                    {
                        "type": "integer",
                        "description": "ID",
                        "name": "id",
                        "in": "path",
                        "required": true
                    }
                ],
                "responses": {
                    "200": {
                        "description": "OK",
                        "schema": {
                            "$ref": "#/definitions/models.Merchent"
                        }
                    }
                }
            }
        },
        "/api/v1/merchent/list-merchent": {
            "get": {
                "description": "Get list of merchent",
                "consumes": [
                    "multipart/form-data"
                ],
                "produces": [
                    "text/plain"
                ],
                "tags": [
                    "Merchents"
                ],
                "summary": "Get list of merchent",
                "operationId": "merchents-merchent-list",
                "parameters": [
                    {
                        "type": "integer",
                        "default": 1,
                        "description": "page number",
                        "name": "page",
                        "in": "query"
                    },
                    {
                        "type": "integer",
                        "default": 10,
                        "description": "number of merchent in single page",
                        "name": "pageSize",
                        "in": "query"
                    }
                ],
                "responses": {
                    "200": {
                        "description": "OK",
                        "schema": {
                            "type": "array",
                            "items": {
                                "$ref": "#/definitions/models.Merchent"
                            }
                        }
                    }
                }
            }
        },
        "/api/v1/merchent/list-merchent-jenis": {
            "get": {
                "description": "Get list of merchent",
                "consumes": [
                    "multipart/form-data"
                ],
                "produces": [
                    "text/plain"
                ],
                "tags": [
                    "Merchents"
                ],
                "summary": "Get list of merchent",
                "operationId": "merchent_jenis-merchent_jenis-list",
                "parameters": [
                    {
                        "type": "integer",
                        "default": 1,
                        "description": "page number",
                        "name": "page",
                        "in": "query"
                    },
                    {
                        "type": "integer",
                        "default": 10,
                        "description": "number of merchent in single page",
                        "name": "pageSize",
                        "in": "query"
                    },
                    {
                        "enum": [
                            "gold",
                            "silver",
                            "platinum",
                            "bronze"
                        ],
                        "type": "string",
                        "description": "jenis merchent",
                        "name": "jenis",
                        "in": "query",
                        "required": true
                    }
                ],
                "responses": {
                    "200": {
                        "description": "OK",
                        "schema": {
                            "type": "array",
                            "items": {
                                "$ref": "#/definitions/models.Merchent"
                            }
                        }
                    }
                }
            }
        },
        "/api/v1/merchent/list-merchent-nama": {
            "get": {
                "description": "Get list of merchent",
                "consumes": [
                    "multipart/form-data"
                ],
                "produces": [
                    "text/plain"
                ],
                "tags": [
                    "Merchents"
                ],
                "summary": "Get list of merchent",
                "operationId": "merchents_name-merchent_name-list",
                "parameters": [
                    {
                        "type": "integer",
                        "default": 1,
                        "description": "page number",
                        "name": "page",
                        "in": "query"
                    },
                    {
                        "type": "integer",
                        "default": 10,
                        "description": "number of merchent in single page",
                        "name": "pageSize",
                        "in": "query"
                    },
                    {
                        "type": "string",
                        "description": "nama merchent",
                        "name": "nama",
                        "in": "query",
                        "required": true
                    }
                ],
                "responses": {
                    "200": {
                        "description": "OK",
                        "schema": {
                            "type": "array",
                            "items": {
                                "$ref": "#/definitions/models.Merchent"
                            }
                        }
                    }
                }
            }
        },
        "/api/v1/merchent/update/{id}": {
            "patch": {
                "description": "Update merchent",
                "consumes": [
                    "multipart/form-data"
                ],
                "produces": [
                    "text/plain"
                ],
                "tags": [
                    "Merchents"
                ],
                "summary": "Update merchent",
                "operationId": "merchents-merchent-update",
                "parameters": [
                    {
                        "type": "integer",
                        "description": "ID",
                        "name": "id",
                        "in": "path",
                        "required": true
                    },
                    {
                        "description": "JSON Request Body",
                        "name": "RequestBody",
                        "in": "body",
                        "required": true,
                        "schema": {
                            "$ref": "#/definitions/controllers.MerchentRequest"
                        }
                    }
                ],
                "responses": {
                    "200": {
                        "description": "OK",
                        "schema": {
                            "type": "string"
                        }
                    }
                }
            }
        },
        "/api/v1/outlet/create": {
            "post": {
                "description": "Create outlet",
                "consumes": [
                    "multipart/form-data"
                ],
                "produces": [
                    "text/plain"
                ],
                "tags": [
                    "Outlets"
                ],
                "summary": "Create outlet",
                "operationId": "outlets-outlet-create",
                "parameters": [
                    {
                        "type": "string",
                        "description": "Name",
                        "name": "name",
                        "in": "formData",
                        "required": true
                    },
                    {
                        "type": "string",
                        "description": "Alamat",
                        "name": "alamat",
                        "in": "formData",
                        "required": true
                    },
                    {
                        "type": "string",
                        "description": "Id Merchent",
                        "name": "merchent_id",
                        "in": "formData",
                        "required": true
                    }
                ],
                "responses": {
                    "200": {
                        "description": "OK",
                        "schema": {
                            "$ref": "#/definitions/models.Outlet"
                        }
                    }
                }
            }
        },
        "/api/v1/outlet/delete/{id}": {
            "delete": {
                "description": "Delete outlet",
                "consumes": [
                    "multipart/form-data"
                ],
                "produces": [
                    "text/plain"
                ],
                "tags": [
                    "Outlets"
                ],
                "summary": "Delete outlet",
                "operationId": "outlets-outlet-delete",
                "parameters": [
                    {
                        "type": "integer",
                        "description": "ID",
                        "name": "id",
                        "in": "path",
                        "required": true
                    }
                ],
                "responses": {
                    "200": {
                        "description": "OK",
                        "schema": {
                            "$ref": "#/definitions/models.Outlet"
                        }
                    }
                }
            }
        },
        "/api/v1/outlet/detail/{id}": {
            "get": {
                "description": "Detail outlet",
                "consumes": [
                    "multipart/form-data"
                ],
                "produces": [
                    "text/plain"
                ],
                "tags": [
                    "Outlets"
                ],
                "summary": "Detail outlet",
                "operationId": "outlets-outlet-detail",
                "parameters": [
                    {
                        "type": "integer",
                        "description": "ID",
                        "name": "id",
                        "in": "path",
                        "required": true
                    }
                ],
                "responses": {
                    "200": {
                        "description": "OK",
                        "schema": {
                            "$ref": "#/definitions/models.Outlet"
                        }
                    }
                }
            }
        },
        "/api/v1/outlet/list-outlet": {
            "get": {
                "description": "Get list of outlet",
                "consumes": [
                    "multipart/form-data"
                ],
                "produces": [
                    "text/plain"
                ],
                "tags": [
                    "Outlets"
                ],
                "summary": "Get list of outlet",
                "operationId": "outlets-outlet-list",
                "parameters": [
                    {
                        "type": "integer",
                        "default": 1,
                        "description": "page number",
                        "name": "page",
                        "in": "query"
                    },
                    {
                        "type": "integer",
                        "default": 10,
                        "description": "number of outlet in single page",
                        "name": "pageSize",
                        "in": "query"
                    }
                ],
                "responses": {
                    "200": {
                        "description": "OK",
                        "schema": {
                            "type": "array",
                            "items": {
                                "$ref": "#/definitions/models.Outlet"
                            }
                        }
                    }
                }
            }
        },
        "/api/v1/outlet/list-outlet-nama": {
            "get": {
                "description": "Get list of outlet",
                "consumes": [
                    "multipart/form-data"
                ],
                "produces": [
                    "text/plain"
                ],
                "tags": [
                    "Outlets"
                ],
                "summary": "Get list of outlet",
                "operationId": "outlets_name-outlet_name-list",
                "parameters": [
                    {
                        "type": "integer",
                        "default": 1,
                        "description": "page number",
                        "name": "page",
                        "in": "query"
                    },
                    {
                        "type": "integer",
                        "default": 10,
                        "description": "number of outlet in single page",
                        "name": "pageSize",
                        "in": "query"
                    },
                    {
                        "type": "string",
                        "description": "nama ooutlet",
                        "name": "nama",
                        "in": "query",
                        "required": true
                    }
                ],
                "responses": {
                    "200": {
                        "description": "OK",
                        "schema": {
                            "type": "array",
                            "items": {
                                "$ref": "#/definitions/models.Outlet"
                            }
                        }
                    }
                }
            }
        },
        "/api/v1/outlet/update/{id}": {
            "patch": {
                "description": "Update outlet",
                "consumes": [
                    "multipart/form-data"
                ],
                "produces": [
                    "text/plain"
                ],
                "tags": [
                    "Outlets"
                ],
                "summary": "Update outlet",
                "operationId": "outlets-outlet-update",
                "parameters": [
                    {
                        "type": "integer",
                        "description": "ID",
                        "name": "id",
                        "in": "path",
                        "required": true
                    },
                    {
                        "description": "JSON Request Body",
                        "name": "RequestBody",
                        "in": "body",
                        "required": true,
                        "schema": {
                            "$ref": "#/definitions/controllers.OutletRequest"
                        }
                    }
                ],
                "responses": {
                    "200": {
                        "description": "OK",
                        "schema": {
                            "type": "string"
                        }
                    }
                }
            }
        },
        "/api/v1/product/create": {
            "post": {
                "security": [
                    {
                        "ApiKeyAuth": []
                    }
                ],
                "description": "Create product",
                "consumes": [
                    "multipart/form-data"
                ],
                "produces": [
                    "text/plain"
                ],
                "tags": [
                    "Products"
                ],
                "summary": "Create product",
                "operationId": "products-product-create",
                "parameters": [
                    {
                        "type": "string",
                        "description": "Name",
                        "name": "name",
                        "in": "formData",
                        "required": true
                    },
                    {
                        "type": "string",
                        "description": "SKU",
                        "name": "sku",
                        "in": "formData",
                        "required": true
                    },
                    {
                        "type": "string",
                        "description": "Deskripsi",
                        "name": "description",
                        "in": "formData",
                        "required": true
                    },
                    {
                        "type": "string",
                        "description": "Code",
                        "name": "code",
                        "in": "formData",
                        "required": true
                    },
                    {
                        "type": "string",
                        "description": "Id Merchent",
                        "name": "merchent_id",
                        "in": "formData",
                        "required": true
                    }
                ],
                "responses": {
                    "200": {
                        "description": "OK",
                        "schema": {
                            "type": "string"
                        }
                    }
                }
            }
        },
        "/api/v1/product/delete/{id}": {
            "delete": {
                "security": [
                    {
                        "ApiKeyAuth": []
                    }
                ],
                "description": "Delete product",
                "consumes": [
                    "multipart/form-data"
                ],
                "produces": [
                    "text/plain"
                ],
                "tags": [
                    "Products"
                ],
                "summary": "Delete product",
                "operationId": "products-product-delete",
                "parameters": [
                    {
                        "type": "integer",
                        "description": "ID",
                        "name": "id",
                        "in": "path",
                        "required": true
                    }
                ],
                "responses": {
                    "200": {
                        "description": "OK",
                        "schema": {
                            "$ref": "#/definitions/models.Product"
                        }
                    }
                }
            }
        },
        "/api/v1/product/detail/{id}": {
            "get": {
                "security": [
                    {
                        "ApiKeyAuth": []
                    }
                ],
                "description": "Detail product",
                "consumes": [
                    "multipart/form-data"
                ],
                "produces": [
                    "text/plain"
                ],
                "tags": [
                    "Products"
                ],
                "summary": "Detail product",
                "operationId": "products-product-detail",
                "parameters": [
                    {
                        "type": "integer",
                        "description": "ID",
                        "name": "id",
                        "in": "path",
                        "required": true
                    }
                ],
                "responses": {
                    "200": {
                        "description": "OK",
                        "schema": {
                            "$ref": "#/definitions/models.Product"
                        }
                    }
                }
            }
        },
        "/api/v1/product/list-product": {
            "get": {
                "security": [
                    {
                        "ApiKeyAuth": []
                    }
                ],
                "description": "Get list of product",
                "consumes": [
                    "multipart/form-data"
                ],
                "produces": [
                    "text/plain"
                ],
                "tags": [
                    "Products"
                ],
                "summary": "Get list of product",
                "operationId": "products-product-list",
                "parameters": [
                    {
                        "type": "integer",
                        "default": 1,
                        "description": "page number",
                        "name": "page",
                        "in": "query"
                    },
                    {
                        "type": "integer",
                        "default": 10,
                        "description": "number of product in single page",
                        "name": "pageSize",
                        "in": "query"
                    }
                ],
                "responses": {
                    "200": {
                        "description": "OK",
                        "schema": {
                            "type": "string"
                        }
                    }
                }
            }
        },
        "/api/v1/product/list-product-nama": {
            "get": {
                "security": [
                    {
                        "ApiKeyAuth": []
                    }
                ],
                "description": "Get list of product",
                "consumes": [
                    "multipart/form-data"
                ],
                "produces": [
                    "text/plain"
                ],
                "tags": [
                    "Products"
                ],
                "summary": "Get list of product",
                "operationId": "product_name-product_name-list",
                "parameters": [
                    {
                        "type": "integer",
                        "default": 1,
                        "description": "page number",
                        "name": "page",
                        "in": "query"
                    },
                    {
                        "type": "integer",
                        "default": 10,
                        "description": "number of product in single page",
                        "name": "pageSize",
                        "in": "query"
                    },
                    {
                        "type": "string",
                        "description": "nama product",
                        "name": "nama",
                        "in": "query",
                        "required": true
                    }
                ],
                "responses": {
                    "200": {
                        "description": "OK",
                        "schema": {
                            "type": "array",
                            "items": {
                                "$ref": "#/definitions/models.Product"
                            }
                        }
                    }
                }
            }
        },
        "/api/v1/product/update/{id}": {
            "patch": {
                "security": [
                    {
                        "ApiKeyAuth": []
                    }
                ],
                "description": "Update product",
                "consumes": [
                    "multipart/form-data"
                ],
                "produces": [
                    "text/plain"
                ],
                "tags": [
                    "Products"
                ],
                "summary": "Update product",
                "operationId": "products-product-update",
                "parameters": [
                    {
                        "type": "integer",
                        "description": "ID",
                        "name": "id",
                        "in": "path",
                        "required": true
                    },
                    {
                        "description": "JSON Request Body",
                        "name": "RequestBody",
                        "in": "body",
                        "required": true,
                        "schema": {
                            "$ref": "#/definitions/controllers.ProductRequest"
                        }
                    }
                ],
                "responses": {
                    "200": {
                        "description": "OK",
                        "schema": {
                            "type": "string"
                        }
                    }
                }
            }
        },
        "/api/v1/product/upload/{id}": {
            "patch": {
                "security": [
                    {
                        "ApiKeyAuth": []
                    }
                ],
                "description": "Upload product",
                "consumes": [
                    "multipart/form-data"
                ],
                "produces": [
                    "text/plain"
                ],
                "tags": [
                    "Products"
                ],
                "summary": "Upload product",
                "operationId": "products-product-upload",
                "parameters": [
                    {
                        "type": "integer",
                        "description": "ID",
                        "name": "id",
                        "in": "path",
                        "required": true
                    },
                    {
                        "type": "file",
                        "description": "Product Image",
                        "name": "product_image",
                        "in": "formData",
                        "required": true
                    }
                ],
                "responses": {
                    "200": {
                        "description": "OK",
                        "schema": {
                            "type": "string"
                        }
                    }
                }
            }
        },
        "/api/v1/user/create": {
            "post": {
                "description": "Create user",
                "consumes": [
                    "multipart/form-data"
                ],
                "produces": [
                    "text/plain"
                ],
                "tags": [
                    "Users"
                ],
                "summary": "Create user",
                "operationId": "users-user-create",
                "parameters": [
                    {
                        "type": "string",
                        "description": "Username",
                        "name": "username",
                        "in": "formData",
                        "required": true
                    },
                    {
                        "type": "string",
                        "description": "Name",
                        "name": "name",
                        "in": "formData",
                        "required": true
                    },
                    {
                        "type": "string",
                        "description": "Alamat",
                        "name": "alamat",
                        "in": "formData",
                        "required": true
                    },
                    {
                        "type": "string",
                        "description": "No Telfon",
                        "name": "no_telp",
                        "in": "formData",
                        "required": true
                    },
                    {
                        "enum": [
                            "laki-laki",
                            "perempuan"
                        ],
                        "type": "string",
                        "description": "Jenis Kelamin",
                        "name": "jk",
                        "in": "formData",
                        "required": true
                    },
                    {
                        "enum": [
                            "admin",
                            "user"
                        ],
                        "type": "string",
                        "description": "Role User",
                        "name": "role",
                        "in": "formData",
                        "required": true
                    },
                    {
                        "type": "string",
                        "description": "Email",
                        "name": "email",
                        "in": "formData",
                        "required": true
                    },
                    {
                        "type": "string",
                        "description": "Password",
                        "name": "password",
                        "in": "formData",
                        "required": true
                    },
                    {
                        "type": "string",
                        "description": "Id Merchent",
                        "name": "merchent_id",
                        "in": "formData",
                        "required": true
                    }
                ],
                "responses": {
                    "200": {
                        "description": "OK",
                        "schema": {
                            "$ref": "#/definitions/models.User"
                        }
                    }
                }
            }
        },
        "/api/v1/user/delete/{id}": {
            "delete": {
                "description": "Delete user",
                "consumes": [
                    "multipart/form-data"
                ],
                "produces": [
                    "text/plain"
                ],
                "tags": [
                    "Users"
                ],
                "summary": "Delete user",
                "operationId": "users-user-delete",
                "parameters": [
                    {
                        "type": "integer",
                        "description": "ID",
                        "name": "id",
                        "in": "path",
                        "required": true
                    }
                ],
                "responses": {
                    "200": {
                        "description": "OK",
                        "schema": {
                            "$ref": "#/definitions/models.User"
                        }
                    }
                }
            }
        },
        "/api/v1/user/detail/{id}": {
            "get": {
                "description": "Detail user",
                "consumes": [
                    "multipart/form-data"
                ],
                "produces": [
                    "text/plain"
                ],
                "tags": [
                    "Users"
                ],
                "summary": "Detail user",
                "operationId": "users-user-detail",
                "parameters": [
                    {
                        "type": "integer",
                        "description": "ID",
                        "name": "id",
                        "in": "path",
                        "required": true
                    }
                ],
                "responses": {
                    "200": {
                        "description": "OK",
                        "schema": {
                            "$ref": "#/definitions/models.User"
                        }
                    }
                }
            }
        },
        "/api/v1/user/list-user": {
            "get": {
                "description": "Get list of user",
                "consumes": [
                    "multipart/form-data"
                ],
                "produces": [
                    "text/plain"
                ],
                "tags": [
                    "Users"
                ],
                "summary": "Get list of user",
                "operationId": "users-user-list",
                "parameters": [
                    {
                        "type": "integer",
                        "default": 1,
                        "description": "page number",
                        "name": "page",
                        "in": "query"
                    },
                    {
                        "type": "integer",
                        "default": 10,
                        "description": "number of user in single page",
                        "name": "pageSize",
                        "in": "query"
                    }
                ],
                "responses": {
                    "200": {
                        "description": "OK",
                        "schema": {
                            "type": "array",
                            "items": {
                                "$ref": "#/definitions/models.User"
                            }
                        }
                    }
                }
            }
        },
        "/api/v1/user/list-user-jk": {
            "get": {
                "description": "Get list of user",
                "consumes": [
                    "multipart/form-data"
                ],
                "produces": [
                    "text/plain"
                ],
                "tags": [
                    "Users"
                ],
                "summary": "Get list of user",
                "operationId": "users_jk-users_jk-list",
                "parameters": [
                    {
                        "type": "integer",
                        "default": 1,
                        "description": "page number",
                        "name": "page",
                        "in": "query"
                    },
                    {
                        "type": "integer",
                        "default": 10,
                        "description": "number of user in single page",
                        "name": "pageSize",
                        "in": "query"
                    },
                    {
                        "enum": [
                            "Laki-laki",
                            "Perempuan"
                        ],
                        "type": "string",
                        "description": "jenis kelamin",
                        "name": "jk",
                        "in": "query",
                        "required": true
                    }
                ],
                "responses": {
                    "200": {
                        "description": "OK",
                        "schema": {
                            "type": "array",
                            "items": {
                                "$ref": "#/definitions/models.User"
                            }
                        }
                    }
                }
            }
        },
        "/api/v1/user/list-user-nama": {
            "get": {
                "description": "Get list of user",
                "consumes": [
                    "multipart/form-data"
                ],
                "produces": [
                    "text/plain"
                ],
                "tags": [
                    "Users"
                ],
                "summary": "Get list of user",
                "operationId": "users_nama-users_nama-list",
                "parameters": [
                    {
                        "type": "integer",
                        "default": 1,
                        "description": "page number",
                        "name": "page",
                        "in": "query"
                    },
                    {
                        "type": "integer",
                        "default": 10,
                        "description": "number of user in single page",
                        "name": "pageSize",
                        "in": "query"
                    },
                    {
                        "type": "string",
                        "description": "nama user",
                        "name": "nama",
                        "in": "query",
                        "required": true
                    }
                ],
                "responses": {
                    "200": {
                        "description": "OK",
                        "schema": {
                            "type": "array",
                            "items": {
                                "$ref": "#/definitions/models.User"
                            }
                        }
                    }
                }
            }
        },
        "/api/v1/user/login": {
            "post": {
                "description": "Login user",
                "consumes": [
                    "application/json"
                ],
                "produces": [
                    "application/json"
                ],
                "tags": [
                    "Users"
                ],
                "summary": "Login user",
                "operationId": "user-login",
                "parameters": [
                    {
                        "description": "JSON Request Body",
                        "name": "RequestBody",
                        "in": "body",
                        "required": true,
                        "schema": {
                            "$ref": "#/definitions/controllers.LoginUser"
                        }
                    }
                ],
                "responses": {
                    "200": {
                        "description": "OK",
                        "schema": {
                            "type": "string"
                        }
                    }
                }
            }
        },
        "/api/v1/user/update/{id}": {
            "patch": {
                "description": "Update user",
                "consumes": [
                    "multipart/form-data"
                ],
                "produces": [
                    "text/plain"
                ],
                "tags": [
                    "Users"
                ],
                "summary": "Update user",
                "operationId": "users-user-update",
                "parameters": [
                    {
                        "type": "integer",
                        "description": "ID",
                        "name": "id",
                        "in": "path",
                        "required": true
                    },
                    {
                        "description": "JSON Request Body",
                        "name": "RequestBody",
                        "in": "body",
                        "required": true,
                        "schema": {
                            "$ref": "#/definitions/controllers.UserRequest"
                        }
                    }
                ],
                "responses": {
                    "200": {
                        "description": "OK",
                        "schema": {
                            "type": "string"
                        }
                    }
                }
            }
        }
    },
    "definitions": {
        "controllers.LoginUser": {
            "type": "object",
            "properties": {
                "email": {
                    "type": "string"
                },
                "password": {
                    "type": "string"
                },
                "username": {
                    "type": "string"
                }
            }
        },
        "controllers.MerchentRequest": {
            "type": "object",
            "properties": {
                "alamat": {
                    "type": "string"
                },
                "jenis": {
                    "type": "string"
                },
                "name": {
                    "type": "string"
                }
            }
        },
        "controllers.OutletRequest": {
            "type": "object",
            "properties": {
                "alamat": {
                    "type": "string"
                },
                "merchent_id": {
                    "type": "string"
                },
                "name": {
                    "type": "string"
                }
            }
        },
        "controllers.ProductRequest": {
            "type": "object",
            "properties": {
                "code": {
                    "type": "string"
                },
                "description": {
                    "type": "string"
                },
                "image": {
                    "type": "string"
                },
                "merchentId": {
                    "type": "string"
                },
                "name": {
                    "type": "string"
                },
                "sku": {
                    "type": "string"
                }
            }
        },
        "controllers.UserRequest": {
            "type": "object",
            "properties": {
                "alamat": {
                    "type": "string"
                },
                "email": {
                    "type": "string"
                },
                "jk": {
                    "type": "string"
                },
                "merchent_id": {
                    "type": "string"
                },
                "name": {
                    "type": "string"
                },
                "no_telp": {
                    "type": "string"
                },
                "password": {
                    "type": "string"
                },
                "role": {
                    "type": "string"
                },
                "username": {
                    "type": "string"
                }
            }
        },
        "models.Merchent": {
            "type": "object",
            "properties": {
                "alamat": {
                    "type": "string"
                },
                "created_at": {
                    "type": "string"
                },
                "id": {
                    "type": "integer"
                },
                "jenis": {
                    "type": "string"
                },
                "name": {
                    "type": "string"
                },
                "updated_at": {
                    "type": "string"
                }
            }
        },
        "models.Outlet": {
            "type": "object",
            "properties": {
                "alamat": {
                    "type": "string"
                },
                "created_at": {
                    "type": "string"
                },
                "id": {
                    "type": "integer"
                },
                "merchent_id": {
                    "type": "integer"
                },
                "name": {
                    "type": "string"
                },
                "updated_at": {
                    "type": "string"
                }
            }
        },
        "models.Product": {
            "type": "object",
            "properties": {
                "code": {
                    "type": "string"
                },
                "created_at": {
                    "type": "string"
                },
                "description": {
                    "type": "string"
                },
                "id": {
                    "type": "integer"
                },
                "image": {
                    "type": "string"
                },
                "merchent_id": {
                    "type": "integer"
                },
                "name": {
                    "type": "string"
                },
                "sku": {
                    "type": "string"
                },
                "updated_at": {
                    "type": "string"
                }
            }
        },
        "models.User": {
            "type": "object",
            "properties": {
                "alamat": {
                    "type": "string"
                },
                "created_at": {
                    "type": "string"
                },
                "email": {
                    "type": "string"
                },
                "id": {
                    "type": "integer"
                },
                "jk": {
                    "type": "string"
                },
                "merchent_id": {
                    "type": "integer"
                },
                "name": {
                    "type": "string"
                },
                "no_telp": {
                    "type": "string"
                },
                "password": {
                    "type": "string"
                },
                "role": {
                    "type": "string"
                },
                "updated_at": {
                    "type": "string"
                },
                "username": {
                    "type": "string"
                }
            }
        }
    },
    "securityDefinitions": {
        "ApiKeyAuth": {
            "type": "apiKey",
            "name": "Authorization",
            "in": "header"
        }
    }
}