-- Merging decision tree log ---
manifest
ADDED from E:\SEM 9\ACO\MasTofin - Copy\app\src\main\AndroidManifest.xml:1:1-82:12
INJECTED from E:\SEM 9\ACO\MasTofin - Copy\app\src\main\AndroidManifest.xml:1:1-82:12
INJECTED from E:\SEM 9\ACO\MasTofin - Copy\app\src\main\AndroidManifest.xml:1:1-82:12
INJECTED from E:\SEM 9\ACO\MasTofin - Copy\app\src\main\AndroidManifest.xml:1:1-82:12
INJECTED from E:\SEM 9\ACO\MasTofin - Copy\app\src\main\AndroidManifest.xml:1:1-82:12
INJECTED from E:\SEM 9\ACO\MasTofin - Copy\app\src\main\AndroidManifest.xml:1:1-82:12
INJECTED from E:\SEM 9\ACO\MasTofin - Copy\app\src\main\AndroidManifest.xml:1:1-82:12
	package
		ADDED from E:\SEM 9\ACO\MasTofin - Copy\app\src\main\AndroidManifest.xml:2:5-33
		INJECTED from E:\SEM 9\ACO\MasTofin - Copy\app\src\main\AndroidManifest.xml
		INJECTED from E:\SEM 9\ACO\MasTofin - Copy\app\src\main\AndroidManifest.xml
	android:versionName
		ADDED from E:\SEM 9\ACO\MasTofin - Copy\app\src\main\AndroidManifest.xml:4:5-30
		INJECTED from E:\SEM 9\ACO\MasTofin - Copy\app\src\main\AndroidManifest.xml
		INJECTED from E:\SEM 9\ACO\MasTofin - Copy\app\src\main\AndroidManifest.xml
	xmlns:android
		ADDED from E:\SEM 9\ACO\MasTofin - Copy\app\src\main\AndroidManifest.xml:1:11-69
	android:versionCode
		ADDED from E:\SEM 9\ACO\MasTofin - Copy\app\src\main\AndroidManifest.xml:3:5-28
		INJECTED from E:\SEM 9\ACO\MasTofin - Copy\app\src\main\AndroidManifest.xml
		INJECTED from E:\SEM 9\ACO\MasTofin - Copy\app\src\main\AndroidManifest.xml
application
ADDED from E:\SEM 9\ACO\MasTofin - Copy\app\src\main\AndroidManifest.xml:8:5-80:19
	android:label
		ADDED from E:\SEM 9\ACO\MasTofin - Copy\app\src\main\AndroidManifest.xml:10:9-41
	android:icon
		ADDED from E:\SEM 9\ACO\MasTofin - Copy\app\src\main\AndroidManifest.xml:9:9-45
	android:theme
		ADDED from E:\SEM 9\ACO\MasTofin - Copy\app\src\main\AndroidManifest.xml:11:9-40
activity#com.sudokuhijaiyah.splash
ADDED from E:\SEM 9\ACO\MasTofin - Copy\app\src\main\AndroidManifest.xml:12:9-22:20
	android:screenOrientation
		ADDED from E:\SEM 9\ACO\MasTofin - Copy\app\src\main\AndroidManifest.xml:15:13-50
	android:label
		ADDED from E:\SEM 9\ACO\MasTofin - Copy\app\src\main\AndroidManifest.xml:14:13-56
	android:name
		ADDED from E:\SEM 9\ACO\MasTofin - Copy\app\src\main\AndroidManifest.xml:13:13-35
activity#com.sudokuhijaiyah.MainActivity
ADDED from E:\SEM 9\ACO\MasTofin - Copy\app\src\main\AndroidManifest.xml:23:9-38:20
	android:screenOrientation
		ADDED from E:\SEM 9\ACO\MasTofin - Copy\app\src\main\AndroidManifest.xml:26:13-50
	android:label
		ADDED from E:\SEM 9\ACO\MasTofin - Copy\app\src\main\AndroidManifest.xml:25:13-56
	android:name
		ADDED from E:\SEM 9\ACO\MasTofin - Copy\app\src\main\AndroidManifest.xml:24:13-41
intent-filter#action:name:android.intent.action.MAIN+category:name:android.intent.category.LAUNCHER
ADDED from E:\SEM 9\ACO\MasTofin - Copy\app\src\main\AndroidManifest.xml:28:13-32:29
action#android.intent.action.MAIN
ADDED from E:\SEM 9\ACO\MasTofin - Copy\app\src\main\AndroidManifest.xml:29:17-69
	android:name
		ADDED from E:\SEM 9\ACO\MasTofin - Copy\app\src\main\AndroidManifest.xml:29:25-66
category#android.intent.category.LAUNCHER
ADDED from E:\SEM 9\ACO\MasTofin - Copy\app\src\main\AndroidManifest.xml:31:17-77
	android:name
		ADDED from E:\SEM 9\ACO\MasTofin - Copy\app\src\main\AndroidManifest.xml:31:27-74
intent-filter#action:name:com.hijaiyah.MENU+category:name:android.intent.category.DEFAULT
ADDED from E:\SEM 9\ACO\MasTofin - Copy\app\src\main\AndroidManifest.xml:33:13-37:29
action#com.hijaiyah.MENU
ADDED from E:\SEM 9\ACO\MasTofin - Copy\app\src\main\AndroidManifest.xml:34:17-60
	android:name
		ADDED from E:\SEM 9\ACO\MasTofin - Copy\app\src\main\AndroidManifest.xml:34:25-57
category#android.intent.category.DEFAULT
ADDED from E:\SEM 9\ACO\MasTofin - Copy\app\src\main\AndroidManifest.xml:36:17-76
	android:name
		ADDED from E:\SEM 9\ACO\MasTofin - Copy\app\src\main\AndroidManifest.xml:36:27-73
activity#com.sudokuhijaiyah.pilihLevel
ADDED from E:\SEM 9\ACO\MasTofin - Copy\app\src\main\AndroidManifest.xml:39:9-48:20
	android:screenOrientation
		ADDED from E:\SEM 9\ACO\MasTofin - Copy\app\src\main\AndroidManifest.xml:42:13-50
	android:label
		ADDED from E:\SEM 9\ACO\MasTofin - Copy\app\src\main\AndroidManifest.xml:41:13-56
	android:name
		ADDED from E:\SEM 9\ACO\MasTofin - Copy\app\src\main\AndroidManifest.xml:40:13-39
intent-filter#action:name:com.hijaiyah.PILIHLEVEL+category:name:android.intent.category.DEFAULT
ADDED from E:\SEM 9\ACO\MasTofin - Copy\app\src\main\AndroidManifest.xml:44:13-47:29
action#com.hijaiyah.PILIHLEVEL
ADDED from E:\SEM 9\ACO\MasTofin - Copy\app\src\main\AndroidManifest.xml:45:17-66
	android:name
		ADDED from E:\SEM 9\ACO\MasTofin - Copy\app\src\main\AndroidManifest.xml:45:25-63
activity#com.sudokuhijaiyah.puzzle
ADDED from E:\SEM 9\ACO\MasTofin - Copy\app\src\main\AndroidManifest.xml:49:9-59:20
	android:screenOrientation
		ADDED from E:\SEM 9\ACO\MasTofin - Copy\app\src\main\AndroidManifest.xml:52:13-50
	android:label
		ADDED from E:\SEM 9\ACO\MasTofin - Copy\app\src\main\AndroidManifest.xml:51:13-56
	android:name
		ADDED from E:\SEM 9\ACO\MasTofin - Copy\app\src\main\AndroidManifest.xml:50:13-35
intent-filter#action:name:com.hijaiyah.PUZZLE+category:name:android.intent.category.DEFAULT
ADDED from E:\SEM 9\ACO\MasTofin - Copy\app\src\main\AndroidManifest.xml:54:13-58:29
action#com.hijaiyah.PUZZLE
ADDED from E:\SEM 9\ACO\MasTofin - Copy\app\src\main\AndroidManifest.xml:55:17-62
	android:name
		ADDED from E:\SEM 9\ACO\MasTofin - Copy\app\src\main\AndroidManifest.xml:55:25-59
activity#com.sudokuhijaiyah.pilihHuruf
ADDED from E:\SEM 9\ACO\MasTofin - Copy\app\src\main\AndroidManifest.xml:60:9-69:20
	android:screenOrientation
		ADDED from E:\SEM 9\ACO\MasTofin - Copy\app\src\main\AndroidManifest.xml:63:13-50
	android:label
		ADDED from E:\SEM 9\ACO\MasTofin - Copy\app\src\main\AndroidManifest.xml:62:13-56
	android:name
		ADDED from E:\SEM 9\ACO\MasTofin - Copy\app\src\main\AndroidManifest.xml:61:13-39
intent-filter#action:name:com.hijaiyah.PILIHHURUF+category:name:android.intent.category.DEFAULT
ADDED from E:\SEM 9\ACO\MasTofin - Copy\app\src\main\AndroidManifest.xml:65:13-68:29
action#com.hijaiyah.PILIHHURUF
ADDED from E:\SEM 9\ACO\MasTofin - Copy\app\src\main\AndroidManifest.xml:66:17-66
	android:name
		ADDED from E:\SEM 9\ACO\MasTofin - Copy\app\src\main\AndroidManifest.xml:66:25-63
activity#com.sudokuhijaiyah.help
ADDED from E:\SEM 9\ACO\MasTofin - Copy\app\src\main\AndroidManifest.xml:70:9-79:20
	android:screenOrientation
		ADDED from E:\SEM 9\ACO\MasTofin - Copy\app\src\main\AndroidManifest.xml:73:13-50
	android:label
		ADDED from E:\SEM 9\ACO\MasTofin - Copy\app\src\main\AndroidManifest.xml:72:13-56
	android:name
		ADDED from E:\SEM 9\ACO\MasTofin - Copy\app\src\main\AndroidManifest.xml:71:13-33
intent-filter#action:name:com.hijaiyah.HELP+category:name:android.intent.category.DEFAULT
ADDED from E:\SEM 9\ACO\MasTofin - Copy\app\src\main\AndroidManifest.xml:75:13-78:29
action#com.hijaiyah.HELP
ADDED from E:\SEM 9\ACO\MasTofin - Copy\app\src\main\AndroidManifest.xml:76:17-60
	android:name
		ADDED from E:\SEM 9\ACO\MasTofin - Copy\app\src\main\AndroidManifest.xml:76:25-57
uses-sdk
INJECTED from E:\SEM 9\ACO\MasTofin - Copy\app\src\main\AndroidManifest.xml reason: use-sdk injection requested
INJECTED from E:\SEM 9\ACO\MasTofin - Copy\app\src\main\AndroidManifest.xml
INJECTED from E:\SEM 9\ACO\MasTofin - Copy\app\src\main\AndroidManifest.xml
INJECTED from E:\SEM 9\ACO\MasTofin - Copy\app\src\main\AndroidManifest.xml
INJECTED from E:\SEM 9\ACO\MasTofin - Copy\app\src\main\AndroidManifest.xml
	android:targetSdkVersion
		INJECTED from E:\SEM 9\ACO\MasTofin - Copy\app\src\main\AndroidManifest.xml
		ADDED from E:\SEM 9\ACO\MasTofin - Copy\app\src\main\AndroidManifest.xml
		INJECTED from E:\SEM 9\ACO\MasTofin - Copy\app\src\main\AndroidManifest.xml
	android:minSdkVersion
		INJECTED from E:\SEM 9\ACO\MasTofin - Copy\app\src\main\AndroidManifest.xml
		ADDED from E:\SEM 9\ACO\MasTofin - Copy\app\src\main\AndroidManifest.xml
		INJECTED from E:\SEM 9\ACO\MasTofin - Copy\app\src\main\AndroidManifest.xml
