//100
//=======================================

    first install all dependencies using npm i 
    baad biya react icon ro nasb kon 
    npm i react-icons

    sakht khod header avaliye+ estefade az react-icon ha ( done done search kon va javab hash to bezar to pasokh)


//==============================================
//101
//==============================================
    header sakhteh shod. react-icon ro nasb kardim va eleman hash ro done done nasb kardim 
    input gozashtim va vorodisho dadim be value khodesh ( ye useState gozashtim)



//=============================================
//102 and 103
//=============================================
    zir on kadr sefaresh, omad kari kard ke gozine hash ghabel click bashan + 
    ye tabe be esm handleOptions sakht ke automar miyad baramon ezafeh ya kam mikoneh
    header.jsx ro bekhoni mifahmi

//===========================================
//104
//==========================================
    karbar har jaye dige click kard bayad on kadr mahv beshe:
    achtung: khaili sar in sokht dadam!!! havaset az in be bad bashe

    1) gharare befahmonim ke karbar koja click kardeh, pass on jayi ke gharareh kharej az on 
            click shod ro hazf konim ro bayad tosh useRef() besazim + ino be on component bayad
            pass bedim age na moshkel misazeh

                    in mishe 
                    function GuestOptionList({options, handleOptions}){
                        
                        const optionsRef=useRef();
                        useOutsideClick(optionsRef);

                        return(
                             <div className="guestOptions" ref={optionsRef}>
                             ....
                             </div>

    2) ye hook be esm in tabeyi ke useRef ro daram behesh pas midam besazim
            hooks > useOutsideClick.jsx 

        kolan in file ro bekhon. ye function sakhtim ke be mousedown goosh mikoneh
        age
        chizi ke rosh click shodeh ba chizi ke rosh useRef() taarif shode fargh dasht, miyad ye tabe be esm clicked
        cd ke ma behesh pas dadim ro ejra mikoneh
        cd chi bodeh? 
        setOpenOptions() ke sharayet baz va basteh boodan kadr ro baramon ejra mikoneh



    3) dobareh omadim to header va in ha ro be on tabe ha pas dadim: 

        function GuestOptionList({options, handleOptions,setOpenOptions}){
            const optionsRef=useRef();
            useOutsideClick(optionsRef, "optionDropDown",() =>setOpenOptions(false));
            return(
                  <div className="guestOptions" ref={optionsRef}> ...
                            in ref={optionRef} 2 saat az vaghtam ro gereft. dige soti nadeh age na chizi entekhab nemishe
                 </div>


//===================================
//105
//===================================
    mikhaym calender to header bezarim :

    npm install --save react-date-range

    to khod site ham tozih dade ke bayad file haye css ro import konim + 2 ta component asli barash gozashteh

    package badi data-fns hast ke inam nasb konin

    npm i date-fns

    kolan to file header.jsx hast kol kar hash

    2 ta chiz hast ke avaz misheh: 1) tarikh raft va bargasht yaro 2) namayesh ya adam namayesh yaro ==> useState barash besazim: 

            const [date, setDate]=useState([{startDate:new Date(), endDate:new Date(), key: "selection",},])
            //view and hide the calender
            const [openDate,setOpenDate]=useState(false);

    in component namayesh zaman ro to bakhsh kodesh to header neshon midim : 
            import { DateRange } from 'react-date-range';
            import { format } from 'date-fns';
            import { HiCalendar } from "react-icons/hi";

            <div className="headerSearchItem">
                <HiCalendar className="headerIcon dateIcon" />
                <div onClick={()=> setOpenDate(!openDate)} className="dateDropDown">{`${format(date[0].startDate,"mm/dd/yy")} to ${format(date[0].endDate,"MM/dd/yy")}`}2023/11/2</div>
                {openDate && <DateRange
                        onChange={item => setDate([item.selection])} 
                        ranges={date}
                        className="date" 
                        minDate={new Date()}
                        moveRangeOnFirstSelection={true}/>}
                        {/* time should ne in an array, so setDate() should contains an array */}
                <span className="seperator"></span>
            </div>
        
    khod <DateRange ro to nemonash gozashteh: bayad to useState besheh ye key dadeh bashi va to khat 100 oon key ro behesh pas bedi
    khat 98 ham darim jahe in ke begim From 1.11.2023 ta 6.11.2023, jash darim automatic neshon midim.


//==================================================
//106
//==================================================
    mikhaym data ha ro fetch konim: 
        npm i react-hot-toast
        npm i axios
    to App.jsx in eleman ro ezafeh kon : 

    import { Toaster } from "react-hot-toast"

    function App() {
        return <div> 
             <Toaster />
             <Header />
             <LocationList />
        </div>
    }

    ye custom hook ham bood ke oon ro ghablan baraye fetch kardan data ha 
    sakhteh boodim, dobareh sedash kardam:
         hooks => useFetch.js  : ino bekhon
    
    file LocationList.jsx to to in adress sakhtim 
        component > LocationList > LocationList.jsx
    ino ham bekhon.
    etelaat ro az ye address darim fetch mikonim va baad data ha ro oon map zadeh



//===========================================
//107
//===========================================
ro project haye local khaili karbord dareh: 

    npm install -g json-server

khob man hanooz backend nasakhtam. man har chizi ke az backend begiram ye json khayad bood. 
oon ro dasti khodam to in address misazam: 

    server > db.json
    
        masalan inja misheh: 
          {
         "hotels": [
                { id: 1 ....
                },
            ],
         "bookmarks": [
            {id:1....}
         ],
          
        }
    kholase endpoint ha ro inja mizarim. khob baraye ejra to terminal bayad type konim: 
            json-server --watch db.json
    sakhteh. 
    pas
    to file package.json mirim va ye masir barash misazim: 

    {
  "name": "booking-app",....
  "scripts": {
    "dev": "vite",
    "server": "json-server --watch server/db.json --port 5000 --delay 500",
    }

    pas age taraf ye terminal baz koni 
    bezaneh: 
        npm run server

    ro port 5000, ba 500 mili saniye taakhir in database baramon ejra misheh. 



//===================================================
//108
//===================================================

    install react-router-dom: 
        npm i react-router-dom

baad to file main.jsx kol ina ro bezar to yek route

    main.jsx: 
        import { BrowserRouter } from "react-router-dom";

        ReactDOM.createRoot(document.getElementById("root")).render(
            <BrowserRouter>
                 <React.StrictMode>
                      <App />
                 </React.StrictMode>
            </BrowserRouter>
        );

hala to App.jsx boro va oon <LocationList /> ro to ye <Route bezr.

hala boro to Header.jsx ta dokme search ro faal koni : ro button on ye function sakhtim be esm handleSearch()
ama in tabe bayad har time ee ke karbar entekhab karede bood ba har maghsadi ro be backend befresteh: => 1)createSearchParams 2)useSearchParams 3)useNavigate
va chizi ke barash zadim: 


        import { createSearchParams, useNavigate, useSearchParams } from 'react-router-dom';

        const Header = () => {
            // for search navigation
                const navigate=useNavigate();
            // what did user search and pass it to the route:
                 const [searchParams, setSearchParams]=useSearchParams();


            // a function to navigate the search menu : 
                const handleSearch=()=>{
 
                const encodedParams= createSearchParams({
                         date:JSON.stringify(date),
                         destination,
                         options:JSON.stringify(options)
                     });
       /* // Action =>  add the upper data to the params 
        setSearchParams(encodedParams);
        */
        
                 navigate({
                         pathname: "/hotels",
                         search: encodedParams.toString(),
                    });
         // navigate("/hotels")
    };


khob in bala chi shod:
        khat 213 component hayi ke lazem darim ro import kard
        khat 217 va 219 ona ro seda kardim ke bezarim to tabe
        to khod tabe: khat 225 tamam etalaati ke mikhaym to navar address befrestim ro ba method to ye moteghayer zakhire kardim

        ravesh dorost ine ke mesl kat 231 oon etelaat ro ba setSearchParams() to navigate befrestim va akhar sar khat 238 , biyaym navigate konim

        vali
        mitonim mesl khat 234 berim oon etelaat ro dasti be navigate() bedim( albate dorost nist )



//===========================================================
//109
//===========================================================

    ye route dige baraye safe search sakhtim to ye folder jadid be esm AppLayout
    az App.jsx masir haye Route ro midadim. 

        <Route path="/hotels" element={<AppLayout />}>
             <Route index element={<div>Hotels</div>} />
             <Route path=":id" element={<div>single hotel</div>} />
        </Route>
    
    to component AppLayout ham in <Outlet /> yadet nare chon on do ta elemnet tosh bayad pas dade beshe

        <div className="sidebar">
            <Outlet /> 
        </div>


//========================================================
//110
//========================================================

    ghabl az in ke begam inja chi kar kardim ye dars gereftam onam che darsi!!
    man ba useFetch ke khodam neveshte boodam dashtam be backend darkhast midadam va hich javab dorosti nemigereftam
    vali
    az in be baad havaset bashe ke 
    khoroji har tabei ro biyay to ye object zakhire koni:

    ba mesal bekham begam:
        const {isLoading, data} =useFetch("http://localhost:5000/hotels");
        const [isLoading, data] =useFetch("http://localhost:5000/hotels");
    khat dovomi behet error mideh ke : ro khoroji useFetch nemitonim iteration bezanim!

        pass ===>
                Adam iteration = bayad object misakhti vali array sakhti
        

    mamolan az on boro check kon ke khoroji on tabe bayad object behet midad ya array....


    in jalase che kardim: 
        aval raftim to App.jsx va ye <Route> gozashtim ke be ye compoentn be esm Hotels.jsx Bere ( ke list hotel ha ro ba tavajoh be location ee ke karbar zadeh kenar naghshe neshon bedim)

            1) dar App.jsx =>    <Route index element={<Hotels></Hotels>} />
            2) ye component be esm Hotels sakhtim ke bere data ha ro ba tavajoh be khaste user ba useFetch() begireh
                const Hotels = () => {
                         const [searchParams, setSearchParams]=useSearchParams();
                         const destination=searchParams.get("destination");
                         const room=JSON.parse(searchParams.get("options"))?.room;

                        const {isLoading, data}=useFetch(
                                                         "http://localhost:5000/hotels",
                                                         `host_location_like=${destination || ""}&name_like=${destination || ""}&accommodates_gte=${room || 1}`);
     
                        if(isLoading) <Loader /> ;
                        return <div>{data.length}</div>;
                  }



                inja mikam etelaat karabr ro befrestam back => useSearchParams() va zakhire kardan on 
                    mikam magsad va otagh ha ro beshomram => khat 302 va 303 ==> etelaat reshte hastan, object kon

                    data ro az oon adress ba vizhegi hayi ke mikahym fetch mikonim: khat 306 va 307

                    component <Loader /> ham chiz khasi nist.


//==============================================
//111
//==============================================
chon etelaat search ro to map nizay darim mibarim, ye compoent barash misazim.( be estelah contex besazim...)

    1)halat paye mishe in: 

        import React, { useContext } from 'react'
        import { createContext } from 'react'

        const HotelContext=createContext();

        const HotelsProvider = ({ children }) => {
                    return (
                         <HotelContext.Provider>{children}</HotelContext.Provider>
                         )
                }

        export default HotelsProvider

        export function useHotels(){
                 return useContext(HotelContext);
            }


    2) hala on etalaati ke bayad bain baksth haye mokhtalef (map va list hotel) share beshe ro inja mizarim (va har chizi ke dependency hast barash)

        import { useSearchParams } from 'react-router-dom';

        const HotelContext=createContext();

        const HotelsProvider = ({ children }) => {
            const [searchParams, setSearchParams]=useSearchParams();
            const destination=searchParams.get("destination");
            const room=JSON.parse(searchParams.get("options"))?.room;

            const {isLoading, data: hotels}=useFetch(
                     "http://localhost:5000/hotels",
                     `q=${destination || ""}&accommodates_gte=${room || 1}`
                     );

            return (
                 <HotelContext.Provider value={{ isLoading, hotels }}>{children}</HotelContext.Provider>
               )
        }

        export default HotelsProvider

        export function useHotels(){
               return useContext(HotelContext);
        }

    3)bayad to file Hotels.jsx in bakhsh ha ro pak konim va jash in file ro faghat vared konim: 
            const Hotels = () => {
                const {isLoading, hotels} = useHotels();
                ...
            }

    4) alan bayad dideh bashi ke vared kardi vali hanoz kar nemikoneh ==> App.jsx bayad ham chis ro befrestim zir majmoe in <HotelsProvider >

            function App() {
                return <div> 
                     <HotelsProvider>
                     ...
                     </HotelsProvider>
                     </div>
            }


component Map ro sakhtim va in contex ro onja ham seda kardim: 
        import { useHotels } from '../context/HotelsProvider'

        const Map = () => {
                const {isLoading, hotels}= useHotels();
                ....
        }

    in homon tabee hast ke dare useContext ro to HotelsProvider seda mikoneh


payan 111 va 112

//==============================================
//113
//==============================================

    baraye naghshe in package ro nasb konid: 
        npm i react-leaflet
    khod site tozih dadeh ke bayad css khas man ro to project ezafe konin 
    @import url("https://unpkg.com/leaflet@1.9.4/dist/leaflet.css"); ===> khodesh automatic ezafeh kardeh
    
    khod site ye mesal baraye naghshe hash avordeh ke hamon ro estefadeh mikonim 
    
    in mesal khod site sazande ro taghyir dadim: location avaliye ke to useState gozastam + hotels ha ro as custome hook gereft va rosh map zadim

            import { useHotels } from '../context/HotelsProvider'
            import { MapContainer, TileLayer , Marker, Popup} from 'react-leaflet';




            const Map = () => {
                     const {isLoading, hotels}= useHotels();
                     const [mapCenter, setMapCenter]= useState([35.7219,51.3347]);
                     return (
                             <div className="mapContainer">
                                  <MapContainer className="map" center={mapCenter} zoom={13} scrollWheelZoom={true} >
                                        <TileLayer attribution='&copy; <a href="https://www.openstreetmap.org/copyright">OpenStreetMap</a> contributors' url="https://{s}.tile.openstreetmap.org/{z}/{x}/{y}.png" />
                                            {hotels.map(item => (
                                                  <Marker key={item.id} position={[item.latitude, item.longitude]}>
                                                     <Popup>
                                                        {item.host_location}
                                                     </Popup>
                                                 </Marker>
                                             ))}
                                     </MapContainer>
                                </div>
                         )
                    }


//====================================================
//114
//====================================================
ghablan to navar address omadim lat va long oon hotel ha ro gozashtim 
hala hamona ro estekhraj kon 
va 
markaz naghshe ro avaz kon ( ghablan to address bar estefadeh kardim )
+ age karbar dokme bargasht ro zad napre

           import { MapContainer, TileLayer , Marker, Popup, useMap} from 'react-leaflet';
           import { useSearchParams } from 'react-router-dom';

          const Map = () => {
                     const {isLoading, hotels}= useHotels();
                     const [mapCenter, setMapCenter]= useState([35.7219,51.3347]);
                     const [searchParams, setSearchParams]= useSearchParams()
                     const lat=searchParams.get("lat");
                     const lng=searchParams.get("lng");
    

                      // to save the last searched location by the user in the memory: 
                         useEffect(()=>{
                                     if(lat && lng) setMapCenter([lat,lng]);
                            },[lat, lng]);

                     return (
                            <div className="mapContainer">
                                    <MapContainer className="map" center={mapCenter} zoom={13}  scrollWheelZoom={true} >
                                        <TileLayer attribution='&copy; <a href="https://www.openstreetmap.org/copyright">OpenStreetMap</a> contributors' url="https://{s}.tile.openstreetmap.org/{z}/{x}/{y}.png" />
                                         {/* change the location based on new searched hotels- the function bellow */}
                                         <ChangeCenter position={[lat || 35.7219,lng || 51.3347]} />
                                             {hotels.map(item => (
                                                      <Marker key={item.id} position={[item.latitude, item.longitude]}>
                                                               <Popup>
                                                                    {item.host_location}
                                                                </Popup>
                                                         </Marker>
                                                      ))}
                                    </MapContainer>
                               </div>
                            )
                }

            export default Map


                function ChangeCenter({position}){
                        const map=useMap();
                        map.setView(position);
                        return null;
                }

        chi shodeh? az navar address bayad etelaat begirim => useSearchParams() => khat 459 gereftamesh, 460 &461 etelaatesho kharej kardam
        2)naghseh avaz beshe => khat 474 ye tabe ke baraye avaz kardane ro seda zadam meghdar haye params ro behesh pass dadam (tabe kaht 490)
        3) age karbar back ro zad akharin hotel barash bemone => useEffect(()=>{},[]) dar khat 465

        nemidonam chara vali mal man kar nakard...



//==================================================
//115
//==================================================
mikhaym etelaat location karbar ro begirim va har ja ke bood naghshe bere hamon ja

    ye <button> to naghshe to Map.jsx mizarimm ke karbar click kard etelaatesho begirim va naghshe taghyir koneh
    gereftan etelaat karbar khaili adiye ===> ye custom hook barash besazim ====> useGeoLocation.js


        import { useState } from "react";

        export default function useGeoLocation(){
                 const [isLoading, setIsLoading]= useState(false);
                 const [position, setPosition]= useState({});
                 const [error, setError]= useState(null);

    
                function getPosition(){
                    if(!navigator.geolocation){ return setError("sorry, your browser does not support the geolocation. ")}
                     setIsLoading(true);
                        //get the user location from browser.
                         //2 scenarios: user give=>first arror function. user reject => second arrow function
                    navigator.geolocation.getCurrentPosition(
                                         (pos)=>{
                                                    setPosition({
                                                              lat: pos.coords.latitude,
                                                              lng: pos.coords.longitude,
                                                             });
                                                  setIsLoading(false);
                                                },
                                        (error)=>{
                                                 setError(error.message);
                                                 setIsLoading(false)
                                                 }
                                );
                 }

                return{isLoading, error, position,getPosition}
                }

    khob inja che kardim: position, error( krbar nadad ye nadareh ke bedeh), loading chizayi and ke mikhaym va taghyir mikonen => useState()
    akhar sar ha homon ro return mikonim
    ye tabe ham neveshtim ke Lat va Lng ro az roo mororgar baramon bekhone va zakhire koneh. agaram nadasht bere tabe error ro baramon bekhoneh.



    to <Map /> (Map.jsx) 
    in custom hook ro seda mikonim: ( ye esm tabe khas dasht hamoon ro seda mikonim): 

        import useGeoLocation from '../../hooks/useGeoLocation';
        const { isLoading: isLoadingPosition , position: geoLocationPosition, getPosition }= useGeoLocation()

    ye useEffect ham misazim ta har vaght etelaat location karbar ro daryaft kardim, mapcenter ro avaz koneh: 

    useEffect(() => {
          if (geoLocationPosition?.lat && geoLocationPosition?.lng){
            setMapCenter([geoLocationPosition.lat, geoLocationPosition.lng]);}
            
        }, [geoLocationPosition]);


    mirim ye button mizarim ke har vaght karbar rosh click kard in tabe getPosition baramon ejra beshe

        <button className="getLocation" onClick={()=>getPosition()}>{isLoadingPosition? "is Loading...": "Use Your Current Location"}</button>


        in <button> kar nemikard ( nemibord ro jayi ke hastim) baad az koli gashtan peydash kardam. 
        mapcenter avaz mishod vali ro tabe nemiraft ta taghyir koneh: 

                    {/* <ChangeCenter position={[lat || 35.7219,lng || 51.3347]} /> */}
                     <ChangeCenter position={mapCenter} />

//============================================================
//116
//============================================================
khob etelaat har hotel ke karbar rosh click kard ro ham kenar map neshon bedeh
ye folder jadid sakhtam singleHoel va ina toshe

        import React from 'react'
        import { useParams } from 'react-router-dom'
        import useFetch from '../../hooks/useFetch'

        const SingleHotel = () => {
             // extract the user search data from the address 
             const {id}= useParams()
             // fetch the hotel data - custom hook
             const { isLoading, data} = useFetch(`http://localhost:5000/hotels/${id}`);
  

             // if the site is in loading condition, show loader
             if(isLoading) return <Loader />;

              return (
                <div className="room">
                      <div className="roomDetail">
                               <h2>{data.name}</h2>
                               <div>
                                    {data.number_of_reviews} reviews &bull; {data.smart_location}
                                </div>
                                <img src={data.xl_picture_url} alt={data.name} />
                     </div>
                 </div>
                )
            }

        export default SingleHotel

    etelaat ke to navar address hast ro ba useParams() gereftam ( khat 588)
    ba custom hook khodam in {id} ro dadam back ta fetch on ro begiram: (line 590) baghisham tozih nadareh

inn hay kar nemikard, fahmidam ke bayad to App.jsx onja ye <Route element={} /> ro avaz mikardam ta neshon bedeh ( khataye tekrari mishe )


//===============================================
//117
//===============================================
akharin bazdid karbar ( akharin hotel eyy ke dide ) ro mikahm ye styel bedam ke rangesh avaz beshe
in jalase az oon jalasat sangin bood ke leham kard vali tonestam dorostesh konam

    tohe Hoels.jsx oon hotel ee ke ghablan ye bar entekhab shode bode ro mikhaym doresh ye kadr abi bekeshim
    vali
    ma ke nemidonim kodom bodeh....
    etalaat oon to singleHotel.jsx gharar migireh
    va 
    ma to hotels.jsx niyazesh daram:

ghablan fekr konam gofte bodam chizi ke hame app betone oon ro bebine ro mizaran to Folder context 

pas in taghyirat etefagh mi ofteh: 


        1)dar hotel.jsx:
        (in currentHotel ro bayad berim to context => HotelProvider besazim)
            const {isLoading, hotels, currentHotel} = useHotels();

            return (
                {
                hotels.map(item =>{
                    return <Link key={item.id} to={`/hotels/${item.id}?lat=${item.latitude}&lng=${item.longitude}`}>
                                {/* add a style just for former selected hotels */}
                                <div className={`searchItem ${item.id === currentHotel?.id ? "current-hotel": ""}`}>
                                ....
                                </div>
                            </Link>
                                 }
                        )
                }
             }
        );

    
    2) dar context => HotelsProvider.jsx
        dar tabe hotelsProvider useState mizarim ta vazyiat va akharin hotel serach shode ro to khodesh bezareh
                data akharin hotel ro az back migiram
                in ke kodom hotel akarin bar search shode ro ham pas midam be back

        in mishe chizayi ke taghyir nakarde bod: 

            const HotelsProvider = ({ children }) => {
                const [currentHotel, setCurrentHotel]=useState(null);
                const [isLoadingCurrHotel, setIsLoadingCurrHotel]=useState(false);

                    async function getHotel(id){
                            setIsLoadingCurrHotel(true);
                            try{
                                const {data}= await axios.get(`http://localhost:5000/hotels/${id}`);
                                setCurrentHotel(data);
                                setIsLoadingCurrHotel(false);
                            } catch(error){
                                  toast.error(error.message);
                                   console.log(error.message);
                                  setIsLoadingCurrHotel(false);
                             }
                        }
                return (
                     <HotelContext.Provider value={{ isLoading, hotels, currentHotel , getHotel, isLoadingCurrHotel}}>
                        {children}
                     </HotelContext.Provider>
                        )
            }

        3)singleHote.jsx
                tamam chizayi ke ghablan khodesh dasht fetch mikard ro alan bayad az provider daryaft koneh: 


            const SingleHotel = () => { 
                            const {id}= useParams();
                            const {getHotel, isLoadingCurrHotel, currentHotel} = useHotels();
  
                            useEffect(()=>{
                                     getHotel(id);
                                     },[id])

 
                if(isLoadingCurrHotel || !currentHotel) return <Loader />;

    
                 return (      
                        <div className="room">
                             <div className="roomDetail">
                                   <h2>{currentHotel.name}</h2>
                                   <div>
                                      {currentHotel.number_of_reviews} reviews &bull; {currentHotel.smart_location}
                                    </div>
                                    <img src={currentHotel.xl_picture_url} alt={currentHotel.name} />
                              </div>
                        </div>
                    )
            }

            export default SingleHotel

khat 698 dahan mano service kard , avalesh chon load nashode bood error midad. jaye in ke setInterval bezari hamon ja shart vojodi ro check kon baad boro jelo 


//=============================================
//118
//=============================================
create a route  for Bookmark pages in App.jsx + create a component called Bookmark.jsx which is the same as <AppLayout /> (import them all )

issue:  when we add a hotel to favoriets, we have to call map again, also how to inform map component, which hotel was choosed?

    solution: in etalaat hotel ha ro to ye component bala tar ( <AppLayout /> ) seda kon va be <Map /> pass bedeh + khod Map ro edit kon ta 
                etelaat ro az vorodi jadidesh begireh. 
                be nazar khodam bayad to App.jsx in hotel ha ro migereftim va be bache ha pass midadim vali omade to <AppLayout /> ke khodesh ye
                      zirmajmoe hast anjam dade vali khob. 
    

    pass:  1_dar App.jsx: 
                        <Route path="/bookmark" element={<Bookmark />} />
    
           2_dar AppLayout.jsx: hotel ha ro inja seda kon va be map pass bedeh: 

                const  AppLayout = () => {
                         const {hotels}= useHotels();
                         return (
                            ....
                            <Map markerLocations={hotels}/>
                            ...
                         )
                }
            3_to khod component <Map /> kari bekon ke hotel ha ro az ini ke behesh pass dadan ( markerLocations) daryaft koneh

                    const Map = ({markerLocations}) => {
                        .....
                        return(
                            ....
                            <DetectClick />
                            // {hotels.map(item => () ) }
                            {markerLocations.map(item => (...) ) }
                        )


                ye tabe ham sakhtim ke karbar ro naghshe click kard etelaatesh bere zakhireh beshe
                  
                    function DetectClick(){
                         const navigate = useNavigate()
                             // this is made by the map provider 
                        useMapEvent({
                                 click: e => navigate(`/bookmark?lat=${e.latlng.lat}&lng=${e.latlng.lng}`)
                         });

                        return null;
                    }


            4_ khod component Bookmark.jsx:
                    import Map from '../Map/Map'

                    const bookmark = ({markerLocations}) => {
                            return (
                                    <div className="appLayout"> 
                                        <div className="sidebar">
                                                 bookmarked Lists are here
                                        </div>
                                        <Map markerLocations={[]} />
                                     </div>
                                    );
                            }

                    export default bookmark
    

            kaht 779 bara ine ke badan oon noghati ke karbar roosh click kard ro be naghash pass bedim
//=================================================
//119
//=================================================
kolan mikhaym bookmark ro dorost konim. 

    1_ to App.jsx route jadid dorost kon: 
            <Route path="/bookmark" element={<BookmarkLayout />} >
                <Route index element={<div>Bookmark list</div>} />
                <Route path="add" element={<div>add new element</div>} />
            </Route>

    2_ < BookmarkLayout /> boro ye <Outlet /> bezar ke route haye dakheli ro ham add koneh + import kardan yadet nareh 

    3_ karbar ro naghshe click mikard ye etefaghi mi oftad, to < Map.jsx /> boro va masir ersal data baad az click ro dorost kon
              function DetectClick(){
                        const navigate = useNavigate()
                        // this is made by the map provider 
                        useMapEvent({
                                 click: e => navigate(`/bookmark/add?lat=${e.latlng.lat}&lng=${e.latlng.lng}`)
                            });
                        return null;
                    }

    4_ kolan bayad ye Provider jadid besazim ( mesl on chici ke ghablan bood HotelsProvider.jsx). hamon ro copy mikonim va chizayi ke nemikhaym ro 
            avaz mikonim. in azash baghi mond to in address:     context  => BookmarkLayout.jsx 

                    
                     import { createContext, useContext , useState} from 'react'
                    import useFetch from '../../hooks/useFetch';
                    import  axios  from 'axios';
                    import {toast} from "react-hot-toast";


                    const BookmarkContext=createContext();

                    const BookmarkListProvider = ({ children }) => {
    
                            // the last hotel that user look
                            const [currentBookmark, setCurrentBookmark]=useState(null);
                             const [isLoadingCurrBookmark, setIsLoadingCurrBookmark]=useState(false); 

                            const {isLoading, data: bookmarks}=useFetch("http://localhost:5000/bookmarks");
    
                            // what was the last thing that user check among hotels
                            async function getBookmark(id){
                                        setIsLoadingCurrBookmark(true);
                                        try{
                                            const {data}= await axios.get(`http://localhost:5000/bookmarks/${id}`);
                                            setCurrentBookmark(data);
                                            setIsLoadingCurrBookmark(false);
                                         } catch(error){
                                             toast.error(error.message);
                                             console.log(error.message);
                                             setIsLoadingCurrBookmark(false);
                                         }
                                } 

                             return (
                                     <BookmarkContext.Provider value={{ isLoading, bookmarks, currentBookmark ,getBookmark, isLoadingCurrBookmark}}>{children}</BookmarkContext.Provider>
                                    )
                        }


                        export default BookmarkListProvider

                    export function useBookmark(){
                              return useContext(BookmarkContext);
                        }
    5_ boro to App.jsx va hame ye ghabli ha ro dakhl in provider jadidi ke sakhti bezar.

                import BookmarkListProvider from "./components/context/BookmarkListContext";


                function App() {
                    return <div> 
                         <BookmarkListProvider>
                         ....
                        </BookmarkListProvider>
                    </div>
                }
//=================================================
//120
//=================================================
in package ro nasb konid: 
        npm i react-country-flag

khob karbar ro masir bookmark omad ye chizi ro neshonesh bedim. chi? to <App.jsx /> to <Route /> boro va masir ro be in eleman jadid biyar:

        1_ inja: 
                <Route index element={<Bookmark />} />

        2_khod in <Bookmark />: components > Bookmark > Bookmark.jsx
            in bere az context, bookmark ha ro bekhoneh va namayesh bedeh:
            ro har kodom ham click kard bere to safhe khas on eleman


            import { useBookmark } from '../context/BookmarkListContext'
            import Loader from '../Loader/Loader'
            import ReactCountryFlag from 'react-country-flag'
            import { Link } from 'react-router-dom'

            const bookmark = () => {
                    const {isLoading,bookmarks}=useBookmark()

                    if(isLoading) return <Loader />
                     return (
                             <div>
                                 <h2>BookmarkList</h2>
                                 <div className="bookmarkList">
                                         {bookmarks.map((item) => {
                                                         return(
                                                            <Link key={item.id} to={`${item.id}?lat=${item.latitude}&lng=${item.longitude}`}>
                                                                 <div className="bookmarkItem"> 
                                                                        <ReactCountryFlag svg countryCode={item.countryCode} />
                                                                         &nbsp; <strong>{item.cityName}</strong> &nbsp; <span>{item.country}</span>
                                                                 </div>
                                                            </Link>
                                                         ) 
                                             })}
                                    </div>
                                </div>
                            )
                    }



            export default bookmark


            inja khat 901 az in library ke taze nasb kardim estefade shod. 
            khat 890 etelaat ro mikhoneh, har kodom to Link hastan ke click kard bere safhe oon. address ham ye chiz relative hast mire az inja be bad

//=============================================================
//121
//=============================================================
berim in route ro besazim: 
            <Route path=":id" element={<div>Single bookmarked element</div>} />


    &larr;   ====> ino misazeh: ( " <- " )


mikhaym vaghti az App.jsx vared oon route shod, in compoennt baramon biyad:  SingleBookmark  >   SingleBookmark.jsx

    const SingleBookmark = () => {
        const {id}= useParams();
        const {isLoadingCurrBookmark,getBookmark, currentBookmark}= useBookmark();
        // for the go back button: 
        const navigete=useNavigate();

        useEffect(()=>{getBookmark(id)},[id]);

         const handleBack = (e) =>{
                 e.preventDefault();
                 navigete(-1);
            }

            if(isLoadingCurrBookmark || !currentBookmark) return <Loader />

     return (
        <div>
            <button onClick={handleBack} className="btn btn--back">&larr; </button>
             <h2>{currentBookmark.cityName}</h2>
            <p>{currentBookmark.cityName} - {currentBookmark.country}</p>
            <ReactCountryFlag svg countryCode={currentBookmark.countryCode} />
        </div>
        )
    }

    export default SingleBookmark

albate: baraye in ke oon khat 945 kar koneh , to async function dar <BookmarkListContext /> raftim currentBookmark ro be null tabdil kardim.
yani moghe fetch shodan data meghdar in ro = null 
chizayi ke mikhad ro ham import kon. 

akhar sar ham to App.jsx:     <Route path=":id" element={<SingleBookmark />} />

//=========================================================
//122
//=========================================================
in element ro mikhaym besazim:  <Route path="add" element={<div>add new element</div>} />


    khob gharare ke in chi basheh? ma ye form dorost mikonim ke karbar etelaatesh ro 
    tosh bezareh
    vali:
    ye location bayad zakhire konim. Az koja? 
    karbar ro map har ja click koneh,ye lat & lng to navar address ezafe mishe. 
    khob
    in ro befreshtam aghab, ye data fetch konam va oon beshe mogheiyat

    1) <Route path="add" element={<AddNewBookmark />} />

    2) AddNewBookmark  > AddNewBookmark.jsx

        in halat kham ooneh: 

                const AddNewBookmark = () => {
                                 //for back button
                                 const navigate=useNavigate();

                                return (
                                         <div>
                                              <h2>Bookmark New Location</h2>
                                              <form className="form">
                                                     <div className="formControl">
                                                         <label htmlFor="cityName">City Name</label>
                                                         <input type="text" name="cityName" id="cityName" placeholder="city"/>
                                                     </div>
                                                     <div className="formControl">
                                                            <label htmlFor="country">Country</label>
                                                            <input type="text" name="country" id="country"  placeholder="country"/>
                                                     </div>
                                                     <div className="buttons">
                                                         <button className="btn btn--back" onClick={(e)=> {e.preventDefault(); navigate(-1)}}> &larr; back</button>
                                                         <button className="btn btn--primary">add to bookmark</button>
                                                     </div>
                                             </form>
                                         </div>
                                    )
                                }

                export default AddNewBookmark

    3)baraye fetch kardan data: ghablan in kar be naghshe ro ye ja dige karde boodim. dobare sedash mikonim. 
        dar component <Map /> zadeh shode => tekrari => boro custom hoock besaz.

        hooks   >  useUrlLocations.js

                 import { useSearchParams } from "react-router-dom";

                 export default function useUrlLocation(){
                             const [searchParams, setSearchParams]= useSearchParams();
                             const lat=searchParams.get("lat")
                             const lng=searchParams.get("lng");

                             return [lat, lng];
                    };

    4) kenar form to <AddnesBookmark /> :


            const AddNewBookmark = () => {
                    const [lat,lng]=useUrlLocation();
                    console.log(lat, lng);
                

dokme bargasht be ghabl: 
    const navigate=useNavigate();
    <button className="btn btn--back" onClick={(e)=> {e.preventDefault(); navigate(-1)}}> &larr; back</button>

//==================================================
//123
//==================================================
    mikhaym jadi karbar ro naghshe click kard, on ro ezafe konim be list bookmark

    faghat to AddnesBookmark.jsx kar darim- ina avaz shodan: 
        const BASE_GEOCODING_URL="https://api.bigdatacloud.net/data/reverse-geocode-client";

    const AddNewBookmark = () => {
            const [cityName, setCityName]=useState("");
            const [country, setCountry]=useState("");
            const [countryCode, setCountryCode]=useState("");
            const [isLoadingGeoCoding, setIsLoadingGeoCoding]=useState(false);
            const [geoCodingError,setGeoCodingError]= useState(null);

        useEffect(()=>{
            // if there were no data in addressbar, stop it !
            if(!lat || !lng) return;

             async function fetchLocationData(){
                    setIsLoadingGeoCoding(true);
                    setGeoCodingError(null);
                            try{
                                const { data }= await axios.get(`${BASE_GEOCODING_URL}?latitude=${lat}&longitude=${lng}`);
                                 // if clicked location was not in a country ( like it was in the middle of sea)
                                 if(!data.countryCode) throw new Error("This location is not in a city!, please click somewhere else.")
                                 setCityName(data.city || data.locality || "");
                                setCountry(data.countryName);
                                setCountryCode(data.countryCode);
                             }catch(error){
                                     setGeoCodingError(error.message);
                             } finally {
                                     setIsLoadingGeoCoding(false);
                             }
                 }

              // important to call it
             fetchLocationData();

         },[lat,lng])


        if(isLoadingGeoCoding) return <Loader />
            // if the location was not in a country( error !data.country ) => catch(error) is fired and setGeoCodingError( ) will be called;
        if(geoCodingError) return <p>{geoCodingError}</p>
        return(
            .....
            <ReactCountryFlag className="flag" svg countryCode={countryCode}/>
        )
   

   tozih: 
    har vaght taraf ro naghseh raft lat, lng dare avaz misheh => in ro useEffect kardim
    to useEffect:
        age lat & lng nabod: kolan return kon ( chizi nadeh)
    ye tabe benevis ke etalaat ro fetch kone + hamon zir tabe sedash kon ta yadet narafteh


    tabe fetch : => try, catch, error bezar
        kaht 1062: data ro az api fetch kon. age country nadasht ye error bezar seresh 
        city, country, countryFlag ro ba oon data set kon. 
    age error pish biyad: to khat 1083 neshon bedeh. 

//=====================================================
//124
//=====================================================
bookmark ha beran to database gharar begiran: 
    1_ to provider on ( hamon jayi ke ghablan dashtim data ha ro fetch mikardim) boro va ye tabe besaz ke har vaght sedash kardan 
        ye data ke be oon tabe dadan ro bere to oon address push kone:

            pass dar context > BookmarkListContext : 
                const BookmarkListProvider = ({ children }) => {
                    ....
                    // a function which will save bookmark data on the db.json
                     async function createBookmark(newBookmark){
                         setIsLoadingCurrBookmark(true);
                        try{
                             const {data}= await axios.post(`http://localhost:5000/bookmarks/`, newBookmark);
                             setCurrentBookmark(data);
                        }catch (error){
                              toast.error(error.message);
                        } finally{
                            setIsLoadingCurrBookmark(false);
                        }
                    }
                    ...
                    return (
                        <BookmarkContext.Provider value={{ ...,createBookmark}}>{children}</BookmarkContext.Provider>
                    )
                }
    
    2_khob to khod jayi ke bookmark jadid ezate mishe ye form gozashteh boodim, boro onja va ro onSubmit oon ye tabe besaz ke in karo bokoneh:

        <form className="form" onSubmit={handleSubmit}>

    va in tabe: chon dareh ba back-end kar mikoneh bayad async benevisim ke baraye javab vayseh
    oon newBookmark={....} bayad moshabeh hamoon etelaati bashe ke ghablan dashtim az database migereftim.


        const { createBookmark }=useBookmark()

        const AddNewBookmark = () => {
            const { createBookmark }=useBookmark()
            ...

             const handleSubmit= async (e)=>{
                      e.preventDefault();
                      if(!cityName || !country) return;

                         const newBookmark={ cityName, country, countryCode, latitude: lat, longitude: lng, host_location: cityName + " " + country};
                     await createBookmark(newBookmark);
                    //  now navigate the user to the bookmark page
                     navigate("/bookmark")
                }
        }

    
    3_vaghti barmigasht to safhe in bookmark haye jadid neshon dade nemishodan chon data ha ro dobare az backend fetch nemikard:
    in koli dahan mano service kard chon az aval raftim to context > BookmarkListContext sharayet fetch kardan ro neveshtim ta beshe akhar sar in khat be oon tabe ezafe besheh: 

             // a function which will save bookmark data on the db.json
             useEffect(()=>{
                async function createBookmark(newBookmark){
                         setIsLoading(true);
                         try{
                            const {data}= await axios.post(`http://localhost:5000/bookmarks/`, newBookmark);
                            setCurrentBookmark(data);
                            // fetch new data from the backend
                            setBookmarks((prev) => [...prev, data]);
                        }catch (error){
                            toast.error(error.message);
                        } finally{
                            setIsLoading(false);
                        }
                    }

                    fetchBookmarkList()
                },[])

   kol taghyirat baraye kaht  1166 bood: + khat 1175 age ejra nashe nemitone bere bookmark haye ghabli ro vaghti berim safe bookmarks neshon nemideh
   ino debug kardam fahmidam. 

4_ dar file BookmarkListContext.jsx in do ta useState() jadid ezafe shodan va to hame ye file, har ja gharar bood data daryaft shode set beshe
az in tabe estefadeh shod + isLoading ham ba hamon anjam shod. 

        // const [isLoadingCurrBookmark, setIsLoadingCurrBookmark]=useState(false); 
        // const {isLoading, data: bookmarks}=useFetch("http://localhost:5000/bookmarks"); --> to har tabe bere data ro khodesh begireh.

        // to call the new added bookmarks
        const [bookmarks, setBookmarks] = useState([]);
        const [isLoading, setIsLoading] = useState(false);

//=========================================================
//125
//=========================================================
    kenar har bookmark mikhaym ye dokmeh bezarim ke ba oon data ro hazf koneh. 
    ze <button> bayad bezarim ke rosh click shod bere va tabe delete konande ro ejra koneh . pas aval tabe delete konnde to besazim: 

    1_ context > BookmarkListContext.jsx 
        const BookmarkListProvider = ({ children }) => {
            ...

                //  a function which will delete the bookmark item: 
                     async function deleteBookmark(id){
                                setIsLoading(true);
                                try{
                                     await axios.delete(`http://localhost:5000/bookmarks/${id}`);
                                     setBookmarks(prev => prev.filter(item => item.id !== id));
                                }catch (error){
                                     toast.error(error.message);
                                } finally{
                                     setIsLoading(false);
                                }
                            }
            return (
                 <BookmarkContext.Provider value={{ ...,deleteBookmark}}>{children}</BookmarkContext.Provider>
                )
        }
    2_hala to bookmark.jsx ye <button> baraye har kodom as item ha bezar ke karbar click kard bere va oon ro delete kone:
        yadet ham bashe ke dara ba backend kar mikoneh:  async ... await


        const bookmark = () => {
                const {isLoading,bookmarks, currentBookmark, deleteBookmark}=useBookmark();

                // deleting function will send data to backend and get confirmation --> async
                const handleDelete= async (e,id) => {
                        // since click on the item will redirect to a single bookmark page, we stop the procedure
                         e.preventDefault();
                        await deleteBookmark(id);
                    }

                 return (
                    ...
                    {bookmarks.map((item) => {...
                                    <button onClick={(e) => handleDelete(e, item.id)}>...</button>
                                        }
                                )
                    }
                 )

project dar asl inja tamome vali mikhaym useContext jash bezarim ke hey nayad baraye har kari ye tabe besazeh:
// ==============================================
//126
//===============================================
    tabdil be context va reducer function 
    faghat ye moshkeli: shoma vaghti reducer function mineveshti on bayat simple mibood ( no side effect ) . inja darim data fetch mikonim pas nemitonim daghig hamon ro bezanim: 

    1_ state ha ro bebar to reducer function:  BookmarkListContext.jsx:
        in do ta ro kharej az on tabe sazande context ye ja bezareshon: 

            
            const initialState ={
                    bookmarks:[],
                    isLoading:false,
                    currentBookmark: null,
                }

            function bookmarkReducer(state, action){
                 // should handle 3 status: 1.Pending 2.sucess 3.rejected
                 switch(action.type){
                        case "loading":
                        case "bookmarks/loaded":
                        case "bookmark/loaded":
                        case "bookmark/created":
                        case "bookmark/deleted":
                        case "rejected":
                            default: throw new Error("Unknown action")
                        }
                }

        2_dakhel khod tabe asli to hamon BookmarkContext.jsx in do ta ro seda mikonim: 

                import React, { useReducer } from 'react'

                const BookmarkListProvider = ({ children }) => {
                        ....
                    const [{bookmarks,isLoading,mark},dispatch]=useReducer(bookmarkReducer, initialState);
                    ....
                    }

        3_ in ghadim to har kodom as oon function haye adi zir khodesh ( deleteBookmark, fetchBookmarkList,....)
            ye seri setIs... ( masalan setIsLoading va ....) bood. ona ro biya avazeshon kon ba in halat fetch: 


            oon tabe reducer dar asl har seri bayad state haye ghabli begire va taghyiri ke mikhad ro rosh ezafe kone ,
            pas oon function in shekli misheh: 


            function bookmarkReducer(state, action){
                     // should handle 3 status: 1.Pending 2.sucess 3.rejected
                     switch(action.type){
                        case "loading": return { ...state,isLoading: true,};
                        case "bookmarks/loaded": return{ ...state, bookmarks: action.payload, isLoading:false,};
                        case "bookmark/loaded":
                        case "bookmark/created":
                        case "bookmark/deleted":
                        case "rejected": return{...state, isLoading:false, error: action.payload,};
                            default: throw new Error("Unknown action")
                         }
                    }

//==================================================
//127
//==================================================

kolan hame ye useState() ha ro be in tabe avaz kardim. az tozih khareje hamin ziri ro bekhon.( 
    ***************************************************************************************************************
    ***************************************************************************************************************
    ***************************************************************************************************************

    inja mohem bood ke che shekli be fetch item tabdil shod.
    in ja ro to ye file dige copy kon va az aval bekhon

    *************************************************************************************************************8**
    ****************************************************************************************************************
    ****************************************************************************************************************

    
)

file BookmarkContext.jsx bode: 
1_useState ha ro comment kardam
2_ye object baraye initial state ha va he tabe baraye reducer ha neveshtam
3_to khod tabe ke dasht context ro render mikard ba useReducer omadam on object va reducer function ro ejra kardam
4_dastkari tak tak async function ha + reducer function asli

5_in ja hayi ke dashtim data ha ro dastkari mikardim ( deleteBookmark, createBookmark) ravesh ine ke kari ke to tabe dasth mishod ro montaghel kardim be 
        reducer function

****************************************************************Az inja copy shavad dar yek file dige *************************

import React, { useReducer } from 'react'
import { createContext, useContext , useState, useEffect} from 'react'
import useFetch from '../../hooks/useFetch';
import  axios  from 'axios';
import {toast} from "react-hot-toast";


const BookmarkContext=createContext();

const initialState = {
  bookmarks:[],
  isLoading:false,
  currentBookmark: null,
  error:null, 
}

function bookmarkReducer(state, action){
  // should handle 3 status: 1.Pending 2.sucess 3.rejected
    switch(action.type){
      case "loading": return { ...state,isLoading: true,};
      case "bookmarks/loaded": return{ ...state, bookmarks: action.payload, isLoading:false,};
        case "bookmark/loaded": return{...state, isLoading:false, currentBookmark: action.payload}
        case "bookmark/created": return{...state, isLoading:false, bookmarks: [...state.bookmarks, action.payload],currentBookmark: action.payload}
        case "bookmark/deleted": return{...state, isLoading:false, bookmarks:state.bookmarks.filter((item) => item.id !== action.payload), currentBookmark:null}
          case "rejected": return{...state, isLoading:false, error: action.payload,};
            default: throw new Error("Unknown action")
    }
}

const BookmarkListProvider = ({ children }) => {
    /* comment to use the reducer function
    // the last hotel that user look
    const [currentBookmark, setCurrentBookmark]=useState(null);
    // const [isLoadingCurrBookmark, setIsLoadingCurrBookmark]=useState(false); 

    // const {isLoading, data: bookmarks}=useFetch("http://localhost:5000/bookmarks");

    // to call the new added bookmarks
    const [bookmarks, setBookmarks] = useState([]);
    const [isLoading, setIsLoading] = useState(false);
    */

    // to use reducer function
    const [{bookmarks,isLoading,currentBookmark},dispatch]=useReducer(bookmarkReducer, initialState);

    // fetch data after the posting new bookmark to backend
    // same as getBookmark, but it doesn't ask for an id:- also in axios.get you should remove the id at the end
    useEffect(()=>{
      async function fetchBookmarkList(){
        // setIsLoading(true);
          dispatch({type: "loading"});
        try{
            const {data}= await axios.get(`http://localhost:5000/bookmarks`);
            // setBookmarks(data);
            dispatch({type:"bookmarks/loaded",payload: data });
        } catch(error){
            toast.error(error.message);
            dispatch({type:"rejected", payload: error.message});
        } finally{
          // setIsLoading(false);
        }
      } 
      // if we dont call it here, none of the bookmarkList in the database will be displayed on the route: "localhost:5173/bookmark"
      fetchBookmarkList()
    },[])

    //  a function which will delete the bookmark item: 
    async function deleteBookmark(id){
      // setIsLoading(true);
      dispatch({type:'loading'});
      try{
          await axios.delete(`http://localhost:5000/bookmarks/${id}`);
          // setBookmarks(prev => prev.filter(item => item.id !== id));
          dispatch({type:"bookmark/deleted",payload: id});
        }catch (error){
          toast.error(error.message);
          dispatch({type:"rejected", payload: error.message});
      } finally{
          // setIsLoading(false);
      }
    }
    
    // what was the last thing that user check among hotels
    async function getBookmark(id){
      // if the last selected item is eqaul to the current one, don't fetch it again.
      if(Number(id)=== currentBookmark?.id) return ;
      // setIsLoading(true);
      dispatch({type:'loading'});
      // setCurrentBookmark(null);
      
      try{
          const {data}= await axios.get(`http://localhost:5000/bookmarks/${id}`);
          // setCurrentBookmark(data);
          dispatch({type: "bookmark/loaded", payload:data});
          // setIsLoading(false);
      } catch(error){
          toast.error(error.message);
          // setIsLoading(false);
          dispatch({type: "rejected", payload:error.message });
      }
    } 


    // a function which will save bookmark data on the db.json
    async function createBookmark(newBookmark){
      // setIsLoading(true);
      dispatch({type: "loading"})
      try{
        const {data}= await axios.post(`http://localhost:5000/bookmarks/`, newBookmark);
        // setCurrentBookmark(data);
        // // fetch new data from the backend
        // setBookmarks((prev) => [...prev, data]);
        dispatch({type:'bookmark/created', payload: data})
      }catch (error){
          toast.error(error.message);
          dispatch({type: "rejected", payload: error.message});
      } finally{
        // setIsLoading(false);
      }
    }



  return (
    <BookmarkContext.Provider value={{ isLoading, bookmarks, currentBookmark ,getBookmark ,createBookmark,deleteBookmark}}>{children}</BookmarkContext.Provider>
  )
}

export default BookmarkListProvider

export function useBookmark(){
    return useContext(BookmarkContext);
}

****************************************************************ta inja ro bayad copy mikardim ******etmam*********************



//====================================================================================================================================
//128
//====================================================================================================================================
adding a login form for the Authentication:
    ye form sade to Login > Login.jsx sakhtim barash

    vorood ba Authentication anjam mishe, boro va ye context barash besaz:
        in yeki ro az aval ba reducer function minevisim jaye useState

        context > AuthProvider.jsx

        import { createContext, useReducer } from "react";

        const AuthContext= createContext();

        const initialState={
                 user: null,
                 isAuthenticated: false,
                }

        function authReducerFunction(state,action) {}

        export default function AuthContextProvider({children}){
                     const [{ user, isAuthenticated },dispatch]= useReducer(authReducerFunction, initialState);
                     return <AuthContext.Provider>{children}</AuthContext.Provider>
            }


khob age user gharar basheh login kone 
    etellatesh ke check shod ye function baraye login va logout dareh
    state va dispatch sakhtim chon to project vagheyi ham bayad ina az ye jayi seda zadeh beshan

    kol fila AuthProvider.jsx in shod:



    import { createContext, useReducer } from "react";

    const AuthContext= createContext();

    const initialState={
         user: null,
         isAuthenticated: false,
    }

    function authReducerFunction(state,action) {
         switch (action.type) {
                 case "login":
                         return {
                             user: action.payload,
                             isAuthenticated: true,
                            };
                case "logout":
                         return {
                              user:null,
                              isAuthenticated:false,
                            };
                default:
                     throw new Error("Unknown action!");
             }
        }

        //the user which can log in : 
        const FAKE_USER={
            name:'samyar',
            email:'samyar@gmail.com',
            password:"1234",
        }

        export default function AuthContextProvider({children}){
            const [{ user, isAuthenticated },dispatch]= useReducer(authReducerFunction, initialState);
    
            function login(email, password){
                if(email ===FAKE_USER.email && password===FAKE_USER.password){
                    dispatch({type:"login", payload: FAKE_USER});
                }
            }

            function logout(){
                dispatch({type: "logout"});
            }
   
            return <AuthContext.Provider value={{user, isAuthenticated, login, logout}}>{children}</AuthContext.Provider>
        }

        export function useAuth(){
            return useContext(AuthContext);
        }


    tozih code: halat avaliye reducer function ro ke neveshteh bodim, hich

    To provider mikahym login ya logout shodan ro check konim va dispatch bedim + 
    in gahrare ye ja dige seda zadeh besheh: be Provider chizayi ke az in file gharare 
    dastresi dashte bashim ro pass bedeh ( ba value =...). khod taraf dastresi va tabe vorod va khoroj 

    tabe vorod va khoroj ro bala taresh zadeh.


    reducer funciton ro to khat 1514 sakhtim. state & action ke to khat 1539 bood ro behesh
    pas dadim. 

    khat 1514 ham baste be sharayeti ke behesh pass dade beshe mire initialState ro avaz mikoneh
    to khat 1554 ye tabe misazim ke age jayi lazem bood AuthContext ro seda konim 
    ye chizi dashteh bashim.

    akhar sar boro to App.jsx va in Provider ro onja ezafeh kon: 
    function App() {
        return <div> 
                    <AuthContextProvider>
                    ...
                    </AuthContextProvider>
                </div>
    }

//===================================================================
//129
//===================================================================

    kolan ghadam ha in hastan: 
    1_ejad contex    (AuthProvider.jsx)
    2_wrap kardan context roye kol tabe   (file App.jsx)
    3_ejraye oon action    (file Login.jsx)

     1_to form login user va login ro ba tabe useAuth ( ke to AuthProvider.jsx sakhtim) seda kon:

    to do ta file inja kar kardim:Login.jsx va Header.jsx
    
    dar Header.jsx: 


    const Header = () => {
        ....
        return (
             <div className="header">
             ....
                <User />
             </div>
        )
    }

     ...
    function User(){
        const navigate=useNavigate();
        // show user its authentication and informations
        const {user, isAuthenticated, logout}= useAuth();
            const handleLogout=()=>{
                    // the logout function is called from useAuth in line 163
                    logout();
                    navigate("/");
                };
        return <div>
            {isAuthenticated ? <div> <span>{user.name}</span> <button onClick={handleLogout}> 	&#8594; Logout</button> </div> : <NavLink to="/login">Login</NavLink>}
         </div>
    }


    va 
    dar file Login.jsx:

    const Login = () => {
        ...
        const {user,login, isAuthenticated}=useAuth();
        // navigate user after login in 
        const navigate=useNavigate();

         const handleSubmit=(e)=>{
                e.preventDefault();
                //if there were email and password, set the login condition:
                if(email && password){ login(email,password);}
            }
        // console.log(user); ok by pressing the submit button, user is made

        useEffect(()=>{
             // the replace: true will prevent the reloading( data will be in the )
             //also, if the user press the back button, he will not get to the login page again
             if(isAuthenticated) {navigate("/",{replace: true});}
            },[isAuthenticated,navigate]);

         return (
            <div className="loginContainer">
                  <h2>Login</h2>
                  <h6>username: samyar@gmail.com</h6>
                  <h6>password: 1234</h6>
                  <form action="" className="form" onSubmit={handleSubmit}>
                  ....
                  </form>
            </div>
         )
    }

    dar 1631 har chi az AuthProvider bodey ro ba oon tabe seda bezan

    age form submit shod ye tabe bayad ejra beshe:1_jeloye reload ro begir
                                                  2_age email va pass dasht Login() ro ejra kon (az Authprovider)
                                                  3_check the location when user is loged in ( useEffect)


//================================================================
//130
//================================================================
taraf ta login nakone nabayad profile dastresi dahti basheh  => Authentication
login ham kard 
ghad admin gahrar nist dastresi behesh bedim   => Authorization


to in sharayet miyaym ye seri az Route ha ro protect mikonim: 
