<svg xmlns="http://www.w3.org/2000/svg" width="19.904" height="19.904" viewBox="0 0 19.904 19.904">
  <g id="vuesax_outline_arrow-down" data-name="vuesax/outline/arrow-down" transform="translate(271.904 -236) rotate(90)">
    <g id="arrow-down" transform="translate(236 252)">
      <path id="Vector" d="M7.188,7.13a2.261,2.261,0,0,1-1.6-.663L.18,1.059A.622.622,0,0,1,1.059.18L6.467,5.588a1.021,1.021,0,0,0,1.443,0L13.317.18a.622.622,0,0,1,.879.879L8.789,6.467A2.261,2.261,0,0,1,7.188,7.13Z" transform="translate(2.764 6.803)" fill="#292d32"/>
      <path id="Vector-2" data-name="Vector" d="M0,0H19.9V19.9H0Z" fill="none" opacity="0"/>
    </g>
  </g>
</svg>
