<svg xmlns="http://www.w3.org/2000/svg" width="20.358" height="42.904" viewBox="0 0 20.358 42.904">
  <g id="Group_18" data-name="Group 18" transform="translate(-962.107 -438.558)">
    <path id="Path_5" data-name="Path 5" d="M0,20.041,17.536,0" transform="translate(963.518 439.97)" fill="none" stroke="#1dc288" stroke-linecap="round" stroke-width="2"/>
    <line id="Line_5" data-name="Line 5" x2="17.536" y2="20.041" transform="translate(963.518 460.011)" fill="none" stroke="#1dc288" stroke-linecap="round" stroke-width="2"/>
  </g>
</svg>
