<svg xmlns="http://www.w3.org/2000/svg" width="17.643" height="19.604" viewBox="0 0 17.643 19.604">
  <path id="trash" d="M19.663,5.921H15.742v-.98A2.941,2.941,0,0,0,12.8,2h-1.96A2.941,2.941,0,0,0,7.9,4.941v.98H3.98a.98.98,0,1,0,0,1.96h.98V18.663A2.941,2.941,0,0,0,7.9,21.6h7.842a2.941,2.941,0,0,0,2.941-2.941V7.881h.98a.98.98,0,1,0,0-1.96Zm-9.8-.98a.98.98,0,0,1,.98-.98H12.8a.98.98,0,0,1,.98.98v.98H9.861Zm6.861,13.723a.98.98,0,0,1-.98.98H7.9a.98.98,0,0,1-.98-.98V7.881h9.8Z" transform="translate(-3 -2)"/>
</svg>
