{
    "data":{
        "components":[{
            "id":"1",
            "title":"Location",
            "values":[
                {
                    "id":"1",
                    "title":"Jakarta, Jakarta, Indonesia",
                    "order":"1"
                },
                {
                    "id":"2",
                    "title":"Bogor, West Java, Indonesia",
                    "order":"2"
                }
            ]
        },{
            "id":"2",
            "title":"Location Exclude",
            "values":[
                {
                    "id":"1",
                    "title":"Jakarta, Jakarta, Indonesia",
                    "order":"1"
                },
                {
                    "id":"2",
                    "title":"Bogor, West Java, Indonesia",
                    "order":"2"
                },
                {
                    "id":"3",
                    "title":"South Jakarta, Jakarta, Indonesia",
                    "order":"3"
                }
            ]
        },{
            "id":"3",
            "title":"Web Interest",
            "values":[
                {
                    "id":"1",
                    "title":"Food and Drinks",
                    "order":"1"
                },
                {
                    "id":"2",
                    "title":"Education",
                    "order":"2"
                },
                {
                    "id":"3",
                    "title":"Music",
                    "order":"3"
                },
                {
                    "id":"3",
                    "title":"Games",
                    "order":"3"
                }
            ]
        },{
            "id":"4",
            "title":"TV Interest",
            "values":[
                {
                    "id":"1",
                    "title":"Food and Drinks",
                    "order":"1"
                },
                {
                    "id":"2",
                    "title":"Education",
                    "order":"2"
                },
                {
                    "id":"3",
                    "title":"Music",
                    "order":"3"
                },
                {
                    "id":"3",
                    "title":"Games",
                    "order":"3"
                }
            ]
        },{
            "id":"5",
            "title":"Call Interest",
            "values":[
                {
                    "id":"1",
                    "title":"Food and Drinks",
                    "order":"1"
                },
                {
                    "id":"2",
                    "title":"Education",
                    "order":"2"
                },
                {
                    "id":"3",
                    "title":"Music",
                    "order":"3"
                },
                {
                    "id":"3",
                    "title":"Games",
                    "order":"3"
                }
            ]
        },{
            "id":"6",
            "title":"Internet Usage",
            "values":[
                {
                    "id":"1",
                    "title":"Food and Drinks",
                    "order":"1"
                },
                {
                    "id":"2",
                    "title":"Education",
                    "order":"2"
                },
                {
                    "id":"3",
                    "title":"Music",
                    "order":"3"
                },
                {
                    "id":"3",
                    "title":"Games",
                    "order":"3"
                }
            ]
        },{
            "id":"7",
            "title":"Tv Usage",
            "values":[
                {
                    "id":"1",
                    "title":"Food and Drinks",
                    "order":"1"
                },
                {
                    "id":"2",
                    "title":"Education",
                    "order":"2"
                },
                {
                    "id":"3",
                    "title":"Music",
                    "order":"3"
                },
                {
                    "id":"3",
                    "title":"Games",
                    "order":"3"
                }
            ]
        },{
            "id":"8",
            "title":"Gender",
            "values":[
                {
                    "id":"1",
                    "title":"Male",
                    "order":"1"
                },
                {
                    "id":"2",
                    "title":"Female",
                    "order":"2"
                },
                {
                    "id":"3",
                    "title":"Unknown",
                    "order":"3"
                }
            ]
        },{
            "id":"9",
            "title":"Age Group",
            "values":[
                {
                    "id":"1",
                    "title":"<20",
                    "order":"1"
                },
                {
                    "id":"2",
                    "title":"20-29",
                    "order":"2"
                },
                {
                    "id":"3",
                    "title":"30-34",
                    "order":"3"
                },
                {
                    "id":"4",
                    "title":"45-60",
                    "order":"3"
                },
                {
                    "id":"5",
                    "title":">60",
                    "order":"3"
                },
                {
                    "id":"6",
                    "title":"30-34",
                    "order":"unknown"
                }
            ]
        },{
            "id":"10",
            "title":"Length Of Stay",
            "values":[
                {
                    "id":"1",
                    "title":"< 6 Months",
                    "order":"1"
                },
                {
                    "id":"2",
                    "title":"6-12 Months",
                    "order":"2"
                },
                {
                    "id":"3",
                    "title":"1-3 Years",
                    "order":"3"
                },
                {
                    "id":"4",
                    "title":"3-5 Years",
                    "order":"3"
                },
                {
                    "id":"5",
                    "title":">5 Years",
                    "order":"3"
                },
                {
                    "id":"6",
                    "title":"30-34",
                    "order":"unknown"
                }
            ]
        },{
            "id":"11",
            "title":"ARPU",
            "values":[
                {
                    "id":"1",
                    "title":"< 100k",
                    "order":"1"
                },
                {
                    "id":"2",
                    "title":"100-500k",
                    "order":"2"
                },
                {
                    "id":"3",
                    "title":"500k-1M",
                    "order":"3"
                },
                {
                    "id":"4",
                    "title":"1M-3M",
                    "order":"3"
                },
                {
                    "id":"5",
                    "title":">3 M",
                    "order":"3"
                },
                {
                    "id":"6",
                    "title":"30-34",
                    "order":"unknown"
                }
            ]
        }]
    }
}